{"text_format":"1","workbook":"xlsx","n_sheets":15,"sheets":["Main.Page","Summary.Sheet","summary2","variables","ppt.county","ppt.events.5","ET.county","ET.region","input.form.data","kcs","water.demand.model","runoff.model","Plot","inverse.design","version.notes"],"not_rendered":{"charts":2,"images":20,"macros":1,"external_links":1,"defined_names":128,"comments":5,"pivot_tables":0},"unopened":[],"bounds":{"document_bytes":16777216,"sheet_cells":100000,"rows_first":2000,"rows_last":500,"rows_between":2000,"halvings":0,"cell_chars":16384,"cell_head_chars":4096},"cells_cut":0,"cells_raw":0,"read":"whole","date_system":"1900"}

{"sheet":"Main.Page","index":0,"n_rows":3,"n_cols":32,"rows_kept":3,"cut":false,"hidden":false,"merged":[]}
[null,null,null,null,null,null,null,null,null,null,null,null,null,null,null,null,null,null,null,null,null,null,null,null,null,null,null,null,null,null,"location/crop","Sved"]
[null,null,null,null,null,null,null,null,null,null,null,null,null,null,null,null,null,null,null,null,null,null,null,null,null,null,null,null,null,null,"Watershed"]
[null,null,null,null,null,null,null,null,null,null,null,null,null,null,null,null,null,null,null,null,null,null,null,null,null,null,null,null,null,null,"Livestock"]

{"sheet":"Summary.Sheet","index":1,"n_rows":28,"n_cols":15,"rows_kept":28,"cut":false,"hidden":false,"merged":[[4,6,4,9],[4,11,4,12]]}
[null,null,"County",{"$f":"county","v":"Johnston "},null,null,{"$f":"IF(pname<>\"\",pname,\"\")","v":"test2"}]
[null,null,"Watershed size",{"$f":"wattotarea","v":0},"acres",null,{"$f":"IF(location<>\"\",location,\"\")","v":"raleigh"}]
[null,null,"Irrigated Area",{"$f":"total.acres","v":100},"acres"]
[]
[null,null,null,"Rainfall","Runoff","Runoff","-----------------Demand------------------",null,null,null,"Deficit","----Cumulative---",null,null,"Monthly "]
[null,null,"Month","in.","inches","Acre-ft","Crop, in","Crop, AF","Livestock, AF","Total, AF","AF","Runoff, AF","Demand, AF","Difference","Excess"]
[null,null,1,{"$f":"IFERROR(runoff.model!B2,0)","v":3.82},{"$f":"IFERROR(IF(wattotarea<>\"\",+runoff.model!K2*12/wattotarea,0),0)","v":0},{"$f":"IFERROR(IF(wattotarea<>\"\",+runoff.model!K2,0),0)","v":0},{"$f":"+water.demand.model!S2","v":0},{"$f":"+water.demand.model!T2","v":0},{"$f":"+water.demand.model!V2","v":0},{"$f":"SUM(H7,I7)","v":0},{"$f":"ABS(MIN(0,F7-J7))","v":0},{"$f":"+F7","v":0},{"$f":"+J7","v":0},{"$f":"+L7-M7","v":0},{"$f":"+F7-J7","v":0}]
[null,null,2,{"$f":"IFERROR(runoff.model!B3,0)","v":3.4},{"$f":"IFERROR(IF(wattotarea<>\"\",+runoff.model!K3*12/wattotarea,0),0)","v":0},{"$f":"IFERROR(IF(wattotarea<>\"\",+runoff.model!K3,0),0)","v":0},{"$f":"+water.demand.model!S3","v":0},{"$f":"+water.demand.model!T3","v":0},{"$f":"+water.demand.model!V3","v":0},{"$f":"SUM(H8,I8)","v":0},{"$f":"ABS(MIN(0,F8-J8))","v":0},{"$f":"+L7+F8","v":0},{"$f":"+M7+J8","v":0},{"$f":"+L8-M8","v":0},{"$f":"+F8-J8","v":0}]
[null,null,3,{"$f":"IFERROR(runoff.model!B4,0)","v":4.16},{"$f":"IFERROR(IF(wattotarea<>\"\",+runoff.model!K4*12/wattotarea,0),0)","v":0},{"$f":"IFERROR(IF(wattotarea<>\"\",+runoff.model!K4,0),0)","v":0},{"$f":"+water.demand.model!S4","v":0},{"$f":"+water.demand.model!T4","v":0},{"$f":"+water.demand.model!V4","v":0},0,0,{"$f":"+L8+F9","v":0},{"$f":"+M8+J9","v":0},0,0]
[null,null,4,{"$f":"IFERROR(runoff.model!B5,0)","v":3.05},{"$f":"IFERROR(IF(wattotarea<>\"\",+runoff.model!K5*12/wattotarea,0),0)","v":0},{"$f":"IFERROR(IF(wattotarea<>\"\",+runoff.model!K5,0),0)","v":0},{"$f":"+water.demand.model!S5","v":0},{"$f":"+water.demand.model!T5","v":0},{"$f":"+water.demand.model!V5","v":0},0,0,0,0,0,0]
[null,null,5,{"$f":"IFERROR(runoff.model!B6,0)","v":3.37},{"$f":"IFERROR(IF(wattotarea<>\"\",+runoff.model!K6*12/wattotarea,0),0)","v":0},{"$f":"IFERROR(IF(wattotarea<>\"\",+runoff.model!K6,0),0)","v":0},{"$f":"+water.demand.model!S6","v":3.5804095656443384},{"$f":"+water.demand.model!T6","v":29.83674638036949},{"$f":"+water.demand.model!V6","v":0},29.83674638036949,29.83674638036949,0,29.83674638036949,-29.83674638036949,-29.83674638036949]
[null,null,6,{"$f":"IFERROR(runoff.model!B7,0)","v":3.91},{"$f":"IFERROR(IF(wattotarea<>\"\",+runoff.model!K7*12/wattotarea,0),0)","v":0},{"$f":"IFERROR(IF(wattotarea<>\"\",+runoff.model!K7,0),0)","v":0},{"$f":"+water.demand.model!S7","v":6.8002826513148706},{"$f":"+water.demand.model!T7","v":56.66902209429059},{"$f":"+water.demand.model!V7","v":0},56.66902209429059,56.66902209429059,0,86.505768474660073,-86.505768474660073,-56.66902209429059]
[null,null,7,{"$f":"IFERROR(runoff.model!B8,0)","v":5.21},{"$f":"IFERROR(IF(wattotarea<>\"\",+runoff.model!K8*12/wattotarea,0),0)","v":0},{"$f":"IFERROR(IF(wattotarea<>\"\",+runoff.model!K8,0),0)","v":0},{"$f":"+water.demand.model!S8","v":0},{"$f":"+water.demand.model!T8","v":0},{"$f":"+water.demand.model!V8","v":0},0,0,0,86.505768474660073,-86.505768474660073,0]
[null,null,8,{"$f":"IFERROR(runoff.model!B9,0)","v":5.32},{"$f":"IFERROR(IF(wattotarea<>\"\",+runoff.model!K9*12/wattotarea,0),0)","v":0},{"$f":"IFERROR(IF(wattotarea<>\"\",+runoff.model!K9,0),0)","v":0},{"$f":"+water.demand.model!S9","v":0},{"$f":"+water.demand.model!T9","v":0},{"$f":"+water.demand.model!V9","v":0},0,0,0,86.505768474660073,-86.505768474660073,0]
[null,null,9,{"$f":"IFERROR(runoff.model!B10,0)","v":4.49},{"$f":"IFERROR(IF(wattotarea<>\"\",+runoff.model!K10*12/wattotarea,0),0)","v":0},{"$f":"IFERROR(IF(wattotarea<>\"\",+runoff.model!K10,0),0)","v":0},{"$f":"+water.demand.model!S10","v":0},{"$f":"+water.demand.model!T10","v":0},{"$f":"+water.demand.model!V10","v":0},0,0,0,86.505768474660073,-86.505768474660073,0]
[null,null,10,{"$f":"IFERROR(runoff.model!B11,0)","v":3.17},{"$f":"IFERROR(IF(wattotarea<>\"\",+runoff.model!K11*12/wattotarea,0),0)","v":0},{"$f":"IFERROR(IF(wattotarea<>\"\",+runoff.model!K11,0),0)","v":0},{"$f":"+water.demand.model!S11","v":0},{"$f":"+water.demand.model!T11","v":0},{"$f":"+water.demand.model!V11","v":0},0,0,0,86.505768474660073,-86.505768474660073,0]
[null,null,11,{"$f":"IFERROR(runoff.model!B12,0)","v":3.19},{"$f":"IFERROR(IF(wattotarea<>\"\",+runoff.model!K12*12/wattotarea,0),0)","v":0},{"$f":"IFERROR(IF(wattotarea<>\"\",+runoff.model!K12,0),0)","v":0},{"$f":"+water.demand.model!S12","v":0},{"$f":"+water.demand.model!T12","v":0},{"$f":"+water.demand.model!V12","v":0},0,0,0,86.505768474660073,-86.505768474660073,0]
[null,null,12,{"$f":"IFERROR(runoff.model!B13,0)","v":3.33},{"$f":"IFERROR(IF(wattotarea<>\"\",+runoff.model!K13*12/wattotarea,0),0)","v":0},{"$f":"IFERROR(IF(wattotarea<>\"\",+runoff.model!K13,0),0)","v":0},{"$f":"+water.demand.model!S13","v":0},{"$f":"+water.demand.model!T13","v":0},{"$f":"+water.demand.model!V13","v":0},0,0,0,86.505768474660073,-86.505768474660073,0]
[]
[null,null,"Total",{"$f":"SUM(D7:D18)","v":46.42},0,0,10.38069221695921,86.505768474660073,0,86.505768474660073,86.505768474660073,null,null,{"$f":"MIN(N7:N18)","v":-86.505768474660073}]
[]
[null,null,"Required Storage",null,null,{"$f":"IF(sum_tot_demand>sum_runoff,\"surface runoff supply inadequate\",IF(sum_deficit>0,MAX(MAX(tot.demand),sum_deficit,rippl),MAX(tot.demand)))","v":"surface runoff supply inadequate"},null,null,null,null," "]
[]
[null,null,"Notes",null,null," "," "]
[null,null,null,null,null," "]
[null,null,{"$f":"IF(AND(wattotarea=0,WatSize=0),\"no watershed area data entered!\",\"\")","v":"no watershed area data entered!"},null,null," ",null," "]
[null,null,{"$f":"IF(total.acres=0,\"no irrigated acres entered!\",\"\")","v":""}]
[null,null,{"$f":"IFERROR(IF(F20<J20,\"Surface Runoff Inadequate -Reduce Demand by reducing acreage, etc.\",\"Surface Runoff Supply Adequate\"),\"Need to enter data\")","v":"Surface Runoff Inadequate -Reduce Demand by reducing acreage, etc."}]

{"sheet":"summary2","index":2,"n_rows":21,"n_cols":18,"rows_kept":21,"cut":false,"hidden":false,"merged":[[5,8,5,12],[5,13,5,17],[5,3,5,7]]}
[]
[]
[" "," "," "]
["County",{"$f":"IF(county<>\"\",county,\"\")","v":"Johnston "},null,null,{"$f":"IF(county<>\"\", \"\",\"no county entered, go home and select county from list in location, crop, and irr. system form\")","v":""}]
[]
[null,null,null,{"$f":"IF(Crop1=\"\",\"NULL\",Crop1)","v":"Corn (sweet)"},null,null,null,null,{"$f":"IF(Crop2=\"\",\"NULL\",Crop2)","v":"NULL"},null,null,null,null,{"$f":"IF(Crop3=\"\",\"NULL\",Crop3)","v":"NULL"}]
["Month","ET0, in.","ppt, in.","Kc","Etc, in.","Pe, in.","NIR, in.","GIR, in.","Kc","Etc, in.","Pe, in.","NIR, in.","GIR, in.","Kc","Etc, in.","Pe, in.","NIR, in.","GIR, in."]
[1,{"$f":"+water.demand.model!B2","v":1.562204724409449},{"$f":"+water.demand.model!G2","v":3.82},{"$f":"+water.demand.model!C2","v":0},{"$f":"+water.demand.model!F2","v":0},{"$f":"IF(E8=0,0,+water.demand.model!H2)","v":0},{"$f":"+water.demand.model!I2","v":0},{"$f":"+water.demand.model!J2","v":0},{"$f":"+water.demand.model!D2","v":0},{"$f":"+water.demand.model!K2","v":0},{"$f":"IF(J8=0,0,+water.demand.model!L2)","v":0},{"$f":"+water.demand.model!M2","v":0},{"$f":"+water.demand.model!N2","v":0},{"$f":"+water.demand.model!E2","v":0},{"$f":"+water.demand.model!O2","v":0},{"$f":"IF(O8=0,0,+water.demand.model!P2)","v":0},{"$f":"+water.demand.model!Q2","v":0},{"$f":"+water.demand.model!R2","v":0}]
[2,{"$f":"+water.demand.model!B3","v":2.0503937007874016},{"$f":"+water.demand.model!G3","v":3.4},{"$f":"+water.demand.model!C3","v":0},{"$f":"+water.demand.model!F3","v":0},{"$f":"IF(E9=0,0,+water.demand.model!H3)","v":0},{"$f":"+water.demand.model!I3","v":0},{"$f":"+water.demand.model!J3","v":0},{"$f":"+water.demand.model!D3","v":0},{"$f":"+water.demand.model!K3","v":0},{"$f":"IF(J9=0,0,+water.demand.model!L3)","v":0},{"$f":"+water.demand.model!M3","v":0},{"$f":"+water.demand.model!N3","v":0},{"$f":"+water.demand.model!E3","v":0},{"$f":"+water.demand.model!O3","v":0},{"$f":"IF(O9=0,0,+water.demand.model!P3)","v":0},{"$f":"+water.demand.model!Q3","v":0},{"$f":"+water.demand.model!R3","v":0}]
[3,{"$f":"+water.demand.model!B4","v":3.5027559055118114},{"$f":"+water.demand.model!G4","v":4.16},{"$f":"+water.demand.model!C4","v":0},{"$f":"+water.demand.model!F4","v":0},{"$f":"IF(E10=0,0,+water.demand.model!H4)","v":0},{"$f":"+water.demand.model!I4","v":0},{"$f":"+water.demand.model!J4","v":0},{"$f":"+water.demand.model!D4","v":0},{"$f":"+water.demand.model!K4","v":0},{"$f":"IF(J10=0,0,+water.demand.model!L4)","v":0},{"$f":"+water.demand.model!M4","v":0},{"$f":"+water.demand.model!N4","v":0},{"$f":"+water.demand.model!E4","v":0},{"$f":"+water.demand.model!O4","v":0},{"$f":"IF(O10=0,0,+water.demand.model!P4)","v":0},{"$f":"+water.demand.model!Q4","v":0},{"$f":"+water.demand.model!R4","v":0}]
[4,{"$f":"+water.demand.model!B5","v":4.9370078740157481},{"$f":"+water.demand.model!G5","v":3.05},{"$f":"+water.demand.model!C5","v":0.14999999999999997},{"$f":"+water.demand.model!F5","v":0.74055118110236207},{"$f":"IF(E11=0,0,+water.demand.model!H5)","v":1.217115171218478},{"$f":"+water.demand.model!I5","v":0},{"$f":"+water.demand.model!J5","v":0},{"$f":"+water.demand.model!D5","v":0},{"$f":"+water.demand.model!K5","v":0},{"$f":"IF(J11=0,0,+water.demand.model!L5)","v":0},{"$f":"+water.demand.model!M5","v":0},{"$f":"+water.demand.model!N5","v":0},{"$f":"+water.demand.model!E5","v":0},{"$f":"+water.demand.model!O5","v":0},{"$f":"IF(O11=0,0,+water.demand.model!P5)","v":0},{"$f":"+water.demand.model!Q5","v":0},{"$f":"+water.demand.model!R5","v":0}]
[5,{"$f":"+water.demand.model!B6","v":6.2122047244094487},{"$f":"+water.demand.model!G6","v":3.37},{"$f":"+water.demand.model!C6","v":0.72499999999999976},{"$f":"+water.demand.model!F6","v":4.5038484251968489},{"$f":"IF(E12=0,0,+water.demand.model!H6)","v":1.6395207726813783},{"$f":"+water.demand.model!I6","v":2.8643276525154704},{"$f":"+water.demand.model!J6","v":3.580409565644338},{"$f":"+water.demand.model!D6","v":0},{"$f":"+water.demand.model!K6","v":0},{"$f":"IF(J12=0,0,+water.demand.model!L6)","v":0},{"$f":"+water.demand.model!M6","v":0},{"$f":"+water.demand.model!N6","v":0},{"$f":"+water.demand.model!E6","v":0},{"$f":"+water.demand.model!O6","v":0},{"$f":"IF(O12=0,0,+water.demand.model!P6)","v":0},{"$f":"+water.demand.model!Q6","v":0},{"$f":"+water.demand.model!R6","v":0}]
[6,{"$f":"+water.demand.model!B7","v":6.6968503937007879},{"$f":"+water.demand.model!G7","v":3.91},{"$f":"+water.demand.model!C7","v":1.1449999999999996},{"$f":"+water.demand.model!F7","v":7.6678937007873991},{"$f":"IF(E13=0,0,+water.demand.model!H7)","v":2.227667579735503},{"$f":"+water.demand.model!I7","v":5.4402261210518965},{"$f":"+water.demand.model!J7","v":6.8002826513148706},{"$f":"+water.demand.model!D7","v":0},{"$f":"+water.demand.model!K7","v":0},{"$f":"IF(J13=0,0,+water.demand.model!L7)","v":0},{"$f":"+water.demand.model!M7","v":0},{"$f":"+water.demand.model!N7","v":0},{"$f":"+water.demand.model!E7","v":0},{"$f":"+water.demand.model!O7","v":0},{"$f":"IF(O13=0,0,+water.demand.model!P7)","v":0},{"$f":"+water.demand.model!Q7","v":0},{"$f":"+water.demand.model!R7","v":0}]
[7,{"$f":"+water.demand.model!B8","v":6.9444881889763792},{"$f":"+water.demand.model!G8","v":5.21},{"$f":"+water.demand.model!C8","v":0.17258064516129035},{"$f":"+water.demand.model!F8","v":1.1984842519685044},{"$f":"IF(E14=0,0,+water.demand.model!H8)","v":1.9894376243196841},{"$f":"+water.demand.model!I8","v":0},{"$f":"+water.demand.model!J8","v":0},{"$f":"+water.demand.model!D8","v":0},{"$f":"+water.demand.model!K8","v":0},{"$f":"IF(J14=0,0,+water.demand.model!L8)","v":0},{"$f":"+water.demand.model!M8","v":0},{"$f":"+water.demand.model!N8","v":0},{"$f":"+water.demand.model!E8","v":0},{"$f":"+water.demand.model!O8","v":0},{"$f":"IF(O14=0,0,+water.demand.model!P8)","v":0},{"$f":"+water.demand.model!Q8","v":0},{"$f":"+water.demand.model!R8","v":0}]
[8,{"$f":"+water.demand.model!B9","v":6.2122047244094487},{"$f":"+water.demand.model!G9","v":5.32},{"$f":"+water.demand.model!C9","v":0},{"$f":"+water.demand.model!F9","v":0},{"$f":"IF(E15=0,0,+water.demand.model!H9)","v":0},{"$f":"+water.demand.model!I9","v":0},{"$f":"+water.demand.model!J9","v":0},{"$f":"+water.demand.model!D9","v":0},{"$f":"+water.demand.model!K9","v":0},{"$f":"IF(J15=0,0,+water.demand.model!L9)","v":0},{"$f":"+water.demand.model!M9","v":0},{"$f":"+water.demand.model!N9","v":0},{"$f":"+water.demand.model!E9","v":0},{"$f":"+water.demand.model!O9","v":0},{"$f":"IF(O15=0,0,+water.demand.model!P9)","v":0},{"$f":"+water.demand.model!Q9","v":0},{"$f":"+water.demand.model!R9","v":0}]
[9,{"$f":"+water.demand.model!B10","v":4.7598425196850407},{"$f":"+water.demand.model!G10","v":4.49},{"$f":"+water.demand.model!C10","v":0},{"$f":"+water.demand.model!F10","v":0},{"$f":"IF(E16=0,0,+water.demand.model!H10)","v":0},{"$f":"+water.demand.model!I10","v":0},{"$f":"+water.demand.model!J10","v":0},{"$f":"+water.demand.model!D10","v":0},{"$f":"+water.demand.model!K10","v":0},{"$f":"IF(J16=0,0,+water.demand.model!L10)","v":0},{"$f":"+water.demand.model!M10","v":0},{"$f":"+water.demand.model!N10","v":0},{"$f":"+water.demand.model!E10","v":0},{"$f":"+water.demand.model!O10","v":0},{"$f":"IF(O16=0,0,+water.demand.model!P10)","v":0},{"$f":"+water.demand.model!Q10","v":0},{"$f":"+water.demand.model!R10","v":0}]
[10,{"$f":"+water.demand.model!B11","v":3.4417322834645669},{"$f":"+water.demand.model!G11","v":3.17},{"$f":"+water.demand.model!C11","v":0},{"$f":"+water.demand.model!F11","v":0},{"$f":"IF(E17=0,0,+water.demand.model!H11)","v":0},{"$f":"+water.demand.model!I11","v":0},{"$f":"+water.demand.model!J11","v":0},{"$f":"+water.demand.model!D11","v":0},{"$f":"+water.demand.model!K11","v":0},{"$f":"IF(J17=0,0,+water.demand.model!L11)","v":0},{"$f":"+water.demand.model!M11","v":0},{"$f":"+water.demand.model!N11","v":0},{"$f":"+water.demand.model!E11","v":0},{"$f":"+water.demand.model!O11","v":0},{"$f":"IF(O17=0,0,+water.demand.model!P11)","v":0},{"$f":"+water.demand.model!Q11","v":0},{"$f":"+water.demand.model!R11","v":0}]
[11,{"$f":"+water.demand.model!B12","v":2.1496062992125986},{"$f":"+water.demand.model!G12","v":3.19},{"$f":"+water.demand.model!C12","v":0},{"$f":"+water.demand.model!F12","v":0},{"$f":"IF(E18=0,0,+water.demand.model!H12)","v":0},{"$f":"+water.demand.model!I12","v":0},{"$f":"+water.demand.model!J12","v":0},{"$f":"+water.demand.model!D12","v":0},{"$f":"+water.demand.model!K12","v":0},{"$f":"IF(J18=0,0,+water.demand.model!L12)","v":0},{"$f":"+water.demand.model!M12","v":0},{"$f":"+water.demand.model!N12","v":0},{"$f":"+water.demand.model!E12","v":0},{"$f":"+water.demand.model!O12","v":0},{"$f":"IF(O18=0,0,+water.demand.model!P12)","v":0},{"$f":"+water.demand.model!Q12","v":0},{"$f":"+water.demand.model!R12","v":0}]
[12,{"$f":"+water.demand.model!B13","v":1.5133858267716536},{"$f":"+water.demand.model!G13","v":3.33},{"$f":"+water.demand.model!C13","v":0},{"$f":"+water.demand.model!F13","v":0},{"$f":"IF(E19=0,0,+water.demand.model!H13)","v":0},{"$f":"+water.demand.model!I13","v":0},{"$f":"+water.demand.model!J13","v":0},{"$f":"+water.demand.model!D13","v":0},{"$f":"+water.demand.model!K13","v":0},{"$f":"IF(J19=0,0,+water.demand.model!L13)","v":0},{"$f":"+water.demand.model!M13","v":0},{"$f":"+water.demand.model!N13","v":0},{"$f":"+water.demand.model!E13","v":0},{"$f":"+water.demand.model!O13","v":0},{"$f":"IF(O19=0,0,+water.demand.model!P13)","v":0},{"$f":"+water.demand.model!Q13","v":0},{"$f":"+water.demand.model!R13","v":0}]
[]
["Total",{"$f":"SUM(B8:B19)","v":49.982677165354332},{"$f":"SUM(C8:C19)","v":46.42},null,{"$f":"SUM(E8:E19)","v":14.110777559055116},{"$f":"SUM(F8:F19)","v":7.0737411479550438},{"$f":"SUM(G8:G19)","v":8.3045537735673669},{"$f":"SUM(H8:H19)","v":10.380692216959208},null,{"$f":"SUM(J8:J19)","v":0},{"$f":"SUM(K8:K19)","v":0},{"$f":"SUM(L8:L19)","v":0},{"$f":"SUM(M8:M19)","v":0},null,{"$f":"SUM(O8:O19)","v":0},{"$f":"SUM(P8:P19)","v":0},{"$f":"SUM(Q8:Q19)","v":0},{"$f":"SUM(R8:R19)","v":0}]

{"sheet":"variables","index":3,"n_rows":33,"n_cols":12,"rows_kept":33,"cut":false,"hidden":false,"merged":[]}
["2012-01-01","Output from Input Screen",null,null,"project name","test2"]
[null,null,null,null,"project location","raleigh"]
[null,null,"Input1",null,"saved date","2018-07-10","7/10/2018"]
[null,"County","Johnston "]
[null,"WatSize, ac",null,null,null,null,null,"rstate1"]
[null,"WatSoil",null,null,null,null,null,"rstate2"]
[null,"Enabled.State",true,false,false,null,null,"watstate"]
[null,"Crops",{"$f":"IF(Plant1<>\"\",TEXT(Plant1,\"d-mmm\"),\"\")","v":"15-Apr"},{"$f":"IF(Plant2<>\"\",TEXT(Plant2,\"d-mmm\"),\"\")","v":""},{"$f":"IF(Plant3<>\"\",TEXT(Plant3,\"d-mmm\"),\"\")","v":""},null,null,"Watershed"]
[null,null,"Crop1","Crop2","Crop3",null,null,"watcovers","Cover1","Cover2","Cover3"]
[null,"Type","Corn (sweet)",null,null,null,null,"Type"]
[null,"Plant","2012-04-15",null,null,null,null,"Area, ac",null,null,null,{"$f":"IF(simplemethod,WatSize,SUM(VALUE(watarea1),VALUE(watarea2),VALUE(watarea3)))","v":0}]
[null,"JD.Plant",{"$f":"+Plant1-$A$1","v":105},{"$f":"+Plant2-$A$1","v":-40909},{"$f":"+Plant3-$A$1","v":-40909},null,null,"HSG",{"$f":"IFERROR(VLOOKUP(WatSoil,input.form.data!$I$2:$J$358,2),\"\")","v":""},{"$f":"IFERROR(VLOOKUP(WatSoil,input.form.data!$I$2:$J$358,2),\"\")","v":""},{"$f":"IFERROR(VLOOKUP(WatSoil,input.form.data!$I$2:$J$358,2),\"\")","v":""}]
[null,"init",{"$f":"IFERROR(VLOOKUP(Crop1,kcs!$B$2:$G$20,2,FALSE),\"\")","v":20},{"$f":"IFERROR(VLOOKUP(Crop2,kcs!$B$2:$G$20,2,FALSE),\"\")","v":""},{"$f":"IFERROR(VLOOKUP(Crop3,kcs!$B$2:$F$16,2,FALSE),\"\")","v":""},null," ","CN",{"$f":"IFERROR(INDEX(input.form.data!$N$1:$R$24,MATCH(cover1,input.form.data!$N$1:$N$24,0),MATCH(hydsg1,input.form.data!$N$1:$R1,1)),\"\")","v":""},{"$f":"IFERROR(INDEX(input.form.data!$N$1:$R$24,MATCH(cover2,input.form.data!$N$1:$N$24,0),MATCH(hydsg2,input.form.data!$N$1:$R1,1)),\"\")","v":""},{"$f":"IFERROR(INDEX(input.form.data!$N$1:$R$24,MATCH(cover3,input.form.data!$N$1:$N$24,0),MATCH(hydsg3,input.form.data!$N$1:$R1,1)),\"\")","v":""},{"$f":"IFERROR(+I13*watarea1/wattotarea+J13*watarea2/wattotarea+K13*watarea3/wattotarea,\"\")","v":""}]
[null,"dev",{"$f":"IFERROR(VLOOKUP(Crop1,kcs!$B$2:$G$20,3,FALSE),\"\")","v":20},{"$f":"IFERROR(VLOOKUP(Crop2,kcs!$B$2:$G$20,3,FALSE),\"\")","v":""},{"$f":"IFERROR(VLOOKUP(Crop3,kcs!$B$2:$F$16,3,FALSE),\"\")","v":""}]
[null,"mid",{"$f":"IFERROR(VLOOKUP(Crop1,kcs!$B$2:$G$20,4,FALSE),\"\")","v":30},{"$f":"IFERROR(VLOOKUP(Crop2,kcs!$B$2:$G$20,4,FALSE),\"\")","v":""},{"$f":"IFERROR(VLOOKUP(Crop3,kcs!$B$2:$F$16,4,FALSE),\"\")","v":""},null,null,"S",{"$f":"IFERROR(1000/wtgdcn-10,\"\")","v":""}]
[null,"late",{"$f":"IFERROR(VLOOKUP(Crop1,kcs!$B$2:$G$20,5,FALSE),\"\")","v":10},{"$f":"IFERROR(VLOOKUP(Crop2,kcs!$B$2:$G$20,5,FALSE),\"\")","v":""},{"$f":"IFERROR(VLOOKUP(Crop3,kcs!$B$2:$F$16,5,FALSE),\"\")","v":""},null,null,"Ia",{"$f":"IFERROR(0.2*S,\"\")","v":""}]
[null,"Total.Days",{"$f":"IFERROR(VLOOKUP(Crop1,kcs!$B$2:$G$20,6,FALSE),\"\")","v":80},{"$f":"IFERROR(VLOOKUP(Crop2,kcs!$B$2:$G$20,6,FALSE),\"\")","v":""},{"$f":"IFERROR(VLOOKUP(Crop3,kcs!$B$2:$G$16,6,FALSE),\"\")","v":""},null,null,"fig. 11 "]
[null,"Acres",100,null,null,{"$f":"IF(DoubleCrop1=TRUE,SUM(VALUE(Acres1),VALUE(Acres3)),SUM(VALUE(Acres1),VALUE(Acres2),VALUE(Acres3)))","v":100},null," "]
[null,"Double.Crop",false,false,null,null,null," "]
[null,null,null,null,null,null,null," "]
[null,"Irrigation system",null,null,null,null,null," "]
[null,null,null,null,null," ",null," "]
[null,"irr.system","Center Pivot",null,null,null,null," "]
[null,"efficiency",80,null,null,null," ",null," "]
[]
[null,null,1,2,3]
[]
[]
[]
[null,"Livestock",false,false,false,false]
[null,"Enabled.state"]
[null,"Type"]
[null,"Head",null,null,null,null,{"$f":"SUM(VALUE(Livestock1),VALUE(Livestock2),VALUE(Livestock3),VALUE(Livestock4))","v":0}]

{"sheet":"ppt.county","index":4,"n_rows":101,"n_cols":39,"rows_kept":101,"cut":false,"hidden":false,"merged":[]}
[null,"coop.id","sta.name","County","lat.dec","long.dec","elev.m","variable",1,2,3,4,5,6,7,8,9,10,11,12,"Name","City","State","County","Lat","Long","Type","RO.NRCS.Ac.ft.RO"]
[142,93783,"BURLINGTON ALAMANCE AP","Alamance ",36.046669999999999,-79.476939999999999,188.1,"mly.prcp.normal",350,329,426,353,352,422,463,420,385,356,331,323,"NA","NA","NA","Alamance County ","NA","NA","NA",{"$f":"INDEX(latlongrunoff,MATCH(pptstalong,longrunoff,1),MATCH(pptstalat,latrunoff,1))","v":3}]
[184,318519,"TAYLORSVILLE","Alexander",35.922499999999999,-81.171599999999998,402.3,"mly.prcp.normal",466,427,438,424,408,465,451,428,388,347,335,401,"NA","NA","NA","Alexander County","NA","NA","NA",1]
[null,null,null,"Alleghany",null,null,null,null,{"$f":"+I6","v":411},{"$f":"+J6","v":382},473,434,473,516,500,501,508,396,498,399]
[111,318964,"WADESBORO","Anson ",34.960299999999997,-80.077200000000005,146.30000000000001,"mly.prcp.normal",398,356,403,294,294,422,490,459,395,380,330,320,"Wadesboro ","Wadesboro ","NC ","Anson County ",34.96,-80.08,"COOP",2]
[106,318694,"TRANSOU","Ashe ",36.3919,-81.303899999999999,876.3,"mly.prcp.normal",411,382,473,434,473,516,500,501,508,396,498,399,"Transou ","Laurel Springs ","NC ","Ashe County ",36.39,-81.3,"COOP",1]
[5,310506,"BANNER ELK","Avery ",36.1616,-81.874099999999999,1149.0999999999999,"mly.prcp.normal",410,397,405,412,431,431,513,428,436,367,366,351,"Banner Elk ","Banner Elk ","NC ","Avery County ",36.159999999999997,-81.87,"COOP",1]
[4,310375,"AURORA 6 N","Beaufort ",35.3872,-76.776300000000006,6.1,"mly.prcp.normal",386,314,399,321,393,502,553,612,518,348,308,318,"Aurora 6 N ","Aurora ","NC ","Beaufort County ",35.39,-76.78,"COOP",3]
[61,314962,"LEWISTON","Bertie ",36.1325,-77.1708,15.2,"mly.prcp.normal",334,323,382,301,341,442,553,517,562,308,292,324,"Lewiston ","Lewiston ","NC ","Bertie County ",36.130000000000003,-77.17,"COOP",3]
[33,312732,"ELIZABETHTOWN 3 SW","Bladen ",34.604399999999998,-78.647999999999996,31.4,"mly.prcp.normal",381,344,391,312,367,470,575,595,529,338,316,314,"Elizabethtown 3 Sw ","Elizabethtown ","NC ","Bladen County ",34.6,-78.650000000000006,"COOP",3]
[155,317813,"SHALLOTTE AG","Brunswick",33.9283,-78.389399999999995,6.1,"mly.prcp.normal",423,343,412,305,388,459,616,688,712,398,288,342,"NA","NA","NA","Brunswick County","NA","NA","NA",3]
[129,3812,"ASHEVILLE AP","Buncombe ",35.431939999999997,-82.537499999999994,645.29999999999995,"mly.prcp.normal",367,376,383,333,366,465,431,440,381,291,365,359,"NA","NA","NA","Buncombe County ","NA","NA","NA",1]
[11,311081,"BRIDGEWATER HYDRO","Burke ",35.7425,-81.837199999999996,350.5,"mly.prcp.normal",372,400,425,385,376,449,489,454,416,356,373,390,"Bridgewater Hydro ","Bridgewater ","NC ","Burke County ",35.74,-81.84,"COOP",1]
[23,311975,"CONCORD","Cabarrus ",35.4163,-80.600499999999997,210.3,"mly.prcp.normal",362,339,422,359,343,435,516,412,383,366,335,319,"Concord ","Concord ","NC ","Cabarrus County ",35.42,-80.599999999999994,"COOP",1.5]
[60,314938,"LENOIR","Caldwell ",35.914999999999999,-81.537700000000001,365.8,"mly.prcp.normal",353,367,433,384,434,457,485,392,419,340,325,378,"Lenoir ","Lenoir ","NC ","Caldwell County ",35.92,-81.540000000000006,"COOP",1]
[null,null,null,"Camden",null,null,null,null,{"$f":"+I71","v":390},{"$f":"+J71","v":325},385,312,398,459,558,569,476,314,326,342]
[134,93765,"BEAUFORT MICHAEL J SMITH FLD","Carteret ",34.733609999999999,-76.660560000000004,3.4,"mly.prcp.normal",408,320,420,355,393,464,602,770,596,388,387,352,"NA","NA","NA","Carteret County ","NA","NA","NA",3]
[187,319704,"YANCEYVILLE 4 SE","Caswell",36.378300000000003,-79.254400000000004,199.6,"mly.prcp.normal",335,330,445,407,378,352,436,580,462,345,381,349,"NA","NA","NA","Caswell County","NA","NA","NA",3]
[175,3810,"HICKORY FAA AP","Catawba ",35.7425,-81.381900000000002,348.4,"mly.prcp.normal",383,372,424,371,368,412,444,410,371,355,346,370,"NA","NA","NA","Catawba County ","NA","NA","NA",1]
[99,317924,"SILER CITY 2 N","Chatham ",35.760599999999997,-79.462199999999996,185.9,"mly.prcp.normal",395,353,449,343,390,390,454,413,424,377,349,325,"Siler City 2 N ","Siler City ","NC ","Chatham County ",35.76,-79.459999999999994,"COOP",3]
[77,316001,"MURPHY","Cherokee ",35.096110000000003,-84.023889999999994,480.4,"mly.prcp.normal",542,526,499,432,510,491,508,426,447,332,485,549,"Murphy ","Murphy ","NC ","Cherokee County ",35.1,-84.02,"COOP",1]
[31,312635,"EDENTON","Chowan ",36.016390000000001,-76.551670000000001,3,"mly.prcp.normal",351,315,402,293,374,482,548,592,494,338,317,305,"Edenton ","Edenton ","NC ","Chowan County ",36.020000000000003,-76.55,"COOP",3]
[172,313921,"HAYESVILLE 1 SW","Clay",35.053330000000003,-83.825000000000003,579.1,"mly.prcp.normal",553,525,497,441,537,536,507,400,518,359,600,472,"NA","NA","NA","Clay County","NA","NA","NA",1]
[98,317845,"SHELBY 2 NNE","Cleveland ",35.314399999999999,-81.533600000000007,280.39999999999998,"mly.prcp.normal",404,368,472,349,410,413,419,424,370,380,371,409,"Shelby 2 Nne ","Shelby ","NC ","Cleveland County ",35.31,-81.53,"COOP",1]
[116,319357,"WHITEVILLE 7 NW","Columbus ",34.409399999999998,-78.791300000000007,27.4,"mly.prcp.normal",380,325,386,302,423,450,551,564,550,309,284,304,"Whiteville 7 Nw ","Whiteville ","NC ","Columbus County ",34.409999999999997,-78.790000000000006,"COOP",3]
[160,93719,"NEW BERN - ASOS","Craven",35.067700000000002,-77.048000000000002,5.8,"mly.prcp.normal",402,366,439,317,415,459,617,665,589,326,340,340,"NA","NA","NA","Craven County","NA","NA","NA",3]
[143,93740,"FAYETTEVILLE RGNL AP","Cumberland ",34.991390000000003,-78.880279999999999,56.7,"mly.prcp.normal",330,276,355,282,324,435,592,549,440,321,277,265,"NA","NA","NA","Cumberland County ","NA","NA","NA",3]
[null,null,null,"Currituck",null,null,null,null,{"$f":"+I71","v":390},{"$f":"+J71","v":325},385,312,398,459,558,569,476,314,326,342]
[183,13766,"MANTEO AP","Dare",35.917299999999997,-75.7,4,"mly.prcp.normal",413,305,431,313,392,501,518,569,464,344,348,399,"NA","NA","NA","Dare County","NA","NA","NA",3]
[62,314970,"LEXINGTON","Davidson ",35.845799999999997,-80.259699999999995,231.6,"mly.prcp.normal",359,371,404,372,321,414,406,412,382,323,341,328,"Lexington ","Lexington ","NC ","Davidson County ",35.85,-80.260000000000005,"COOP",1.5]
[69,315743,"MOCKSVILLE 5SE","Davie ",35.843800000000002,-80.497200000000007,244.4,"mly.prcp.normal",347,358,410,371,335,426,397,393,384,344,336,358,"Mocksville 5se ","Mocksville ","NC ","Davie County ",35.840000000000003,-80.5,"COOP",1.5]
[162,319026,"WALLACE","Duplin",34.72,-77.977800000000002,8.8000000000000007,"mly.prcp.normal",403,355,411,349,411,555,604,655,637,351,340,349,"NA","NA","NA","Duplin County","NA","NA","NA",3]
[169,3758,"DURHAM 11 W","Durham ",35.970500000000001,-79.093100000000007,171.3,"mly.prcp.normal",364,320,426,327,356,394,475,406,426,347,362,336,"NA","NA","NA","Durham County ","NA","NA","NA",3]
[92,317400,"ROCKY MT 8 ESE","Edgecombe ",35.893610000000002,-77.68056,33.5,"mly.prcp.normal",354,324,408,326,356,435,507,471,525,316,288,311,"Rocky Mt 8 Ese ","Rocky Mount ","NC ","Edgecombe County ",35.89,-77.680000000000007,"COOP",3]
[135,93807,"WINSTON SALEM RYNLDS AP","Forsyth",36.133609999999997,-80.222219999999993,295.7,"mly.prcp.normal",361,319,404,370,387,420,500,487,419,341,335,347,"NA","NA","NA","Forsyth County","NA","NA","NA",1.5,null,null,null,"Acres-ft.RO"]
[65,315123,"LOUISBURG","Franklin ",36.102800000000002,-78.303899999999999,79.2,"mly.prcp.normal",370,325,406,334,380,402,444,506,418,336,317,325,"Louisburg ","Louisburg ","NC ","Franklin County ",36.1,-78.3,"COOP",3,null,null," ",33,34,35,35.5,36,37," "," "]
[137,53870,"GASTONIA MUNI AP","Gaston ",35.196669999999997,-81.155829999999995,242.9,"mly.prcp.normal",386,351,419,319,317,390,398,408,353,365,325,330,"NA","NA","NA","Gaston County ","NA","NA","NA",{"$f":"INDEX(latlongrunoff,MATCH(pptstalong,longrunoff,1),MATCH(pptstalat,latrunoff,1))","v":1},null,null,-85,"NA","NA",1,1,1,1]
[null,null,null,"Gates",null,null,null,null,{"$f":"+I47","v":379},{"$f":"+J47","v":351},407,362,404,454,510,446,465,345,307,360,null,null,null,null,null,null,null,4]
[171,317346,"ROBBINSVILLE 1 S","Graham ",35.304400000000001,-83.811300000000003,678.2,"mly.prcp.normal",557,558,557,478,487,514,511,529,500,390,466,586,"NA","NA","NA","Graham County ","NA","NA","NA",1,null,null,-84,1,1,1,1,1,1]
[153,316510,"OXFORD AG","Granville ",36.302219999999998,-78.610830000000007,152.4,"mly.prcp.normal",321,283,484,308,358,405,469,540,389,358,305,372,"NA","NA","NA","Granville County ","NA","NA","NA",3,null,null,-83,1,1,1,1,1,1]
[null,null,null,"Greene",null,null,null,null,{"$f":"+I55","v":374},{"$f":"+J55","v":319},389,313,371,506,558,541,571,306,308,308,null,null,null,null,null,null,null,3]
[154,13723,"GREENSBORO  AP","Guilford ",36.083329999999997,-79.95,271.3,"mly.prcp.normal",306,296,373,357,338,373,448,388,419,316,311,298,"NA","NA","NA","Guilford County ","NA","NA","NA",2,null,null,-82,1,1,1,1,1,1]
[188,317725,"SCOTLAND NECK #2","Halifax ",36.136899999999997,-77.423100000000005,30.5,"mly.prcp.normal",368,317,370,367,323,481,446,467,460,329,287,331,"NA","NA","NA","Halifax County ","NA","NA","NA",3,null,null,-81,2,2,1.5,1.5,1.5,1.5]
[28,312500,"DUNN 4 NW","Harnett ",35.3247,-78.688100000000006,61,"mly.prcp.normal",357,347,387,326,362,447,621,552,432,315,306,325,"Dunn 4 Nw ","Dunn ","NC ","Harnett County ",35.32,-78.69,"COOP",3,null,null,-80,3,3,2,2,2,2]
[115,319147,"WAYNESVILLE 1 E","Haywood ",35.486600000000003,-82.968299999999999,810.2,"mly.prcp.normal",431,448,440,376,434,407,370,420,394,265,378,409,"Waynesville 1 E ","Waynesville ","NC ","Haywood County ",35.49,-82.97,"COOP",1,null,null,-79.5,3,3,3,3,3,2]
[38,313106,"FLETCHER 3 W","Henderson ",35.426600000000001,-82.557400000000001,630.9,"mly.prcp.normal",419,409,439,364,407,508,478,500,433,317,383,407,"Fletcher 3 W ","Fletcher ","NC ","Henderson County ",35.43,-82.56,"COOP",1,null,null,-79,3,3,3,3,3,3]
[76,315996,"MURFREESBORO","Hertford ",36.452100000000002,-77.080299999999994,30.5,"mly.prcp.normal",379,351,407,362,404,454,510,446,465,345,307,360,"Murfreesboro ","Murfreesboro ","NC ","Hertford County ",36.450000000000003,-77.08,"COOP",3,null,null,-78,3,3,3,3,3,4]
[132,317056,"RAEFORD","Hoke",34.987000000000002,-79.218999999999994,76.2,"mly.prcp.normal",386,348,442,287,312,459,542,506,431,331,305,305,"NA","NA","NA","Hoke County","NA","NA","NA",3,null,null,-77,3,3,3,3,3,4]
[124,318450,"SWANQUARTER FERRY","Hyde",35.395000000000003,-76.325999999999993,0.9,"mly.prcp.normal",398,332,423,343,399,513,555,760,590,341,402,370,"NA","NA","NA","Hyde County","NA","NA","NA",3,null,null,-76,3,3,3,3,3,4]
[103,318292,"STATESVILLE 2 NNE","Iredell ",35.809899999999999,-80.880799999999994,289.60000000000002,"mly.prcp.normal",342,336,417,357,339,423,415,382,365,339,328,364,"Statesville 2 Nne ","Statesville ","NC ","Iredell County ",35.81,-80.88,"COOP",1.5]
[26,312200,"CULLOWHEE","Jackson ",35.311599999999999,-83.174700000000001,668.1,"mly.prcp.normal",465,463,445,390,448,485,441,407,422,301,423,442,"Cullowhee ","Cullowhee ","NC ","Jackson County ",35.31,-83.17,"COOP",1]
[21,311820,"CLAYTON WTP","Johnston ",35.640799999999999,-78.463300000000004,91.4,"mly.prcp.normal",382,340,416,305,337,391,521,532,449,317,319,333,"Clayton Wtp ","Clayton ","NC ","Johnston County ",35.64,-78.459999999999994,"COOP",3]
[107,318706,"TRENTON","Jones ",35.062779999999997,-77.35472,9.1,"mly.prcp.normal",404,348,415,319,393,498,615,638,620,366,304,345,"Trenton ","Trenton ","NC ","Jones County ",35.06,-77.349999999999994,"COOP",3]
[97,317656,"SANFORD 8 NE","Lee ",35.534700000000001,-79.046400000000006,79.900000000000006,"mly.prcp.normal",387,351,399,286,352,463,514,472,412,358,330,297,"Sanford 8 Ne ","Sanford ","NC ","Lee County ",35.53,-79.05,"COOP",3]
[56,314689,"KINSTON AG RSCH","Lenoir ",35.297499999999999,-77.572199999999995,18.3,"mly.prcp.normal",374,319,389,313,371,506,558,541,571,306,308,308,"Kinston Ag Rsch ","Kinston ","NC ","Lenoir County ",35.299999999999997,-77.569999999999993,"COOP",3]
[63,314996,"LINCOLNTON 4 W","Lincoln ",35.460560000000001,-81.328890000000001,274.3,"mly.prcp.normal",385,365,450,348,401,404,406,450,345,414,355,387,"Lincolnton 4 W ","Lincolnton ","NC ","Lincoln County ",35.46,-81.33,"COOP",1]
[25,312102,"COWEETA EXP STN","Macon ",35.059100000000001,-83.431299999999993,685.5,"mly.prcp.normal",663,671,642,524,527,582,486,480,590,454,645,635,"Coweeta Exp Stn ","Coweeta ","NC ","Macon County ",35.06,-83.43,"COOP",1]
[51,314260,"HOT SPRINGS","Madison ",35.895000000000003,-82.831109999999995,425.5,"mly.prcp.normal",348,351,367,352,479,420,455,411,307,215,279,314,"Hot Springs ","Hot Springs ","NC ","Madison County ",35.9,-82.83,"COOP",1]
[118,319440,"WILLIAMSTON 1 E","Martin ",35.852899999999998,-77.030600000000007,6.1,"mly.prcp.normal",382,315,412,317,374,471,529,554,607,390,308,324,"Williamston 1 E ","Williamston ","NC ","Martin County ",35.85,-77.03,"COOP",3]
[67,315340,"MARION 2 NW","Mcdowell ",35.662999999999997,-82.0291,446.8,"mly.prcp.normal",406,416,463,424,470,486,484,445,445,350,395,441,"Marion 2 Nw ","Marion ","NC ","Mcdowell County ",35.659999999999997,-82.03,"COOP",1]
[144,13881,"CHARLOTTE DOUGLAS AP","Mecklenburg",35.223599999999998,-80.955200000000005,221.9,"mly.prcp.normal",341,332,401,304,318,374,368,422,324,340,314,325,"NA","NA","NA","Mecklenburg County","NA","NA","NA",1.5]
[null,null,null,"Mitchell",null,null,null,null,{"$f":"+I101","v":511},{"$f":"+J101","v":502},552,450,497,471,467,532,499,382,467,456]
[53,314464,"JACKSON SPRINGS 5 WNW","Montgomery ",35.1858,-79.677199999999999,222.5,"mly.prcp.normal",388,354,404,305,309,405,503,512,422,372,332,327,"Jackson Springs 5 Wnw ","Jackson Springs ","NC ","Montgomery County ",35.19,-79.680000000000007,"COOP",2]
[14,311515,"CARTHAGE WTP","Moore ",35.332000000000001,-79.406599999999997,134.1,"mly.prcp.normal",395,343,432,298,342,429,498,514,438,356,346,342,"Carthage Wtp ","Carthage ","NC ","Moore County ",35.33,-79.41,"COOP",3]
[174,93759,"ROCKY MT WILSON AP","Nash ",35.854999999999997,-77.893060000000006,48.8,"mly.prcp.normal",360,290,390,312,343,413,490,482,443,309,304,293,"NA","NA","NA","Nash County ","NA","NA","NA",3]
[180,13748,"WILMINGTON INTL AP","New Hanover ",34.267499999999998,-77.899699999999996,10.1,"mly.prcp.normal",376,362,421,282,449,518,748,741,784,389,329,362,"NA","NA","NA","New Hanover County ","NA","NA","NA",3]
[52,314456,"JACKSON","Northampton ",36.396700000000003,-77.423900000000003,39.6,"mly.prcp.normal",361,311,414,343,357,403,536,495,468,330,326,342,"Jackson ","Jackson ","NC ","Northampton County ",36.4,-77.42,"COOP",3]
[168,314471,"JACKSONVILLE EOC","Onslow ",34.796599999999998,-77.400800000000004,5.2,"mly.prcp.normal",388,327,409,316,395,536,668,692,616,348,311,422,"NA","NA","NA","Onslow County ","NA","NA","NA",3]
[156,93785,"CHAPEL HILL WILLIAMS AP","Orange ",35.933329999999998,-79.064170000000004,156.1,"mly.prcp.normal",383,332,449,311,367,374,402,445,427,318,320,318,"NA","NA","NA","Orange County ","NA","NA","NA",3]
[6,310576,"BAYBORO 3 SW","Pamlico ",35.131100000000004,-76.816000000000003,1.5,"mly.prcp.normal",385,321,400,361,412,518,627,725,588,398,378,375,"Bayboro 3 Sw ","Bayboro ","NC ","Pamlico County ",35.130000000000003,-76.819999999999993,"COOP",3]
[32,312719,"ELIZABETH CITY","Pasquotank ",36.309719999999999,-76.204999999999998,2.4,"mly.prcp.normal",390,325,385,312,398,459,558,569,476,314,326,342,"Elizabeth City ","Elizabeth City ","NC ","Pasquotank County ",36.31,-76.209999999999994,"COOP",3]
[117,319423,"WILLARD 4 SW","Pender ",34.661200000000001,-78.045500000000004,16.8,"mly.prcp.normal",389,350,406,325,395,520,660,661,608,362,294,337,"Willard 4 Sw ","Willard ","NC ","Pender County ",34.659999999999997,-78.05,"COOP",{"$f":"INDEX(latlongrunoff,MATCH(pptstalong,longrunoff,1),MATCH(pptstalat,latrunoff,1))","v":3}]
[null,null,null,"Perquimans",null,null,null,null,{"$f":"+I71","v":390},{"$f":"+J71","v":325},385,312,398,459,558,569,476,314,326,342]
[94,317516,"ROXBORO 7 ESE","Person ",36.346400000000003,-78.885800000000003,216.4,"mly.prcp.normal",381,333,445,334,335,384,457,389,391,372,346,370,"Roxboro 7 Ese ","Roxboro ","NC ","Person County ",36.35,-78.89,"COOP",3]
[44,313638,"GREENVILLE","Pitt ",35.64,-77.398399999999995,9.8000000000000007,"mly.prcp.normal",386,335,404,317,385,431,539,614,583,325,312,325,"Greenville ","Greenville ","NC ","Pitt County ",35.64,-77.400000000000006,"COOP",3]
[108,318744,"TRYON","Polk ",35.205800000000004,-82.251599999999996,365.8,"mly.prcp.normal",510,486,576,458,457,538,527,618,538,465,480,524,"Tryon ","Tryon ","NC ","Polk County ",35.21,-82.25,"COOP",1]
[3,310286,"ASHEBORO 2 W","Randolph ",35.704439999999998,-79.837779999999995,265.2,"mly.prcp.normal",383,364,402,364,352,390,408,417,394,368,341,327,"Asheboro 2 W ","Asheboro ","NC ","Randolph County ",35.700000000000003,-79.84,"COOP",2]
[45,313784,"HAMLET","Richmond ",34.8872,-79.6922,106.7,"mly.prcp.normal",379,342,383,285,323,473,616,480,475,396,332,316,"Hamlet ","Hamlet ","NC ","Richmond County ",34.89,-79.69,"COOP",3]
[159,13776,"LUMBERTON REGIONAL AP","Robeson ",34.608060000000002,-79.059169999999995,36.9,"mly.prcp.normal",297,290,333,282,305,434,548,550,480,257,287,289,"NA","NA","NA","Robeson County ","NA","NA","NA",3]
[88,317202,"REIDSVILLE 2 NW","Rockingham ",36.3825,-79.694699999999997,271.3,"mly.prcp.normal",386,340,431,390,382,394,481,392,418,345,345,333,"Reidsville 2 Nw ","Reidsville ","NC ","Rockingham County ",36.380000000000003,-79.69,"COOP",2]
[96,317618,"SALISBURY 9 WNW","Rowan ",35.696599999999997,-80.622699999999995,251.5,"mly.prcp.normal",342,350,410,354,321,428,342,379,375,329,314,337,"Salisbury 9 Wnw ","Salisbury ","NC ","Rowan County ",35.700000000000003,-80.62,"COOP",1.5]
[173,313152,"FOREST CITY 8 W","Rutherford ",35.3125,-81.988889999999998,258.8,"mly.prcp.normal",421,397,474,370,442,458,447,470,429,377,402,430,"NA","NA","NA","Rutherford County ","NA","NA","NA",1]
[22,311881,"CLINTON 2 NE","Sampson ",35.024700000000003,-78.275800000000004,48.2,"mly.prcp.normal",371,321,400,299,362,472,602,590,513,302,312,318,"Clinton 2 Ne ","Clinton ","NC ","Sampson County ",35.020000000000003,-78.28,"COOP",3]
[136,93782,"LAURINBURG MAXTON AP","Scotland ",34.791670000000003,-79.366110000000006,67.099999999999994,"mly.prcp.normal",309,232,300,255,341,375,465,434,458,316,251,260,"NA","NA","NA","Scotland County ","NA","NA","NA",3]
[1,310090,"ALBEMARLE","Stanly  ",35.399169999999998,-80.199439999999996,185.9,"mly.prcp.normal",405,351,437,345,363,471,553,464,430,379,336,342,"Albemarle ","Albemarle ","NC ","Stanly County ",35.4,-80.2,"COOP",1.5]
[27,312238,"DANBURY","Stokes ",36.414700000000003,-80.216899999999995,256,"mly.prcp.normal",368,304,429,355,403,401,501,430,456,360,325,360,"Danbury ","Danbury ","NC ","Stokes County ",36.409999999999997,-80.22,"COOP",1.5]
[34,312740,"ELKIN","Surry ",36.254399999999997,-80.864999999999995,265.2,"mly.prcp.normal",375,337,417,398,394,402,487,401,392,334,306,363,"Elkin ","Elkin ","NC ","Surry County ",36.25,-80.87,"COOP",1.5]
[80,316341,"OCONALUFTEE","Swain ",35.5261,-83.308899999999994,621.79999999999995,"mly.prcp.normal",487,469,504,431,513,439,491,394,424,284,449,494,"Oconaluftee ","Oconaluftee ","NC ","Swain County ",35.53,-83.31,"COOP",1]
[10,311055,"BREVARD","Transylvania ",35.228299999999997,-82.735799999999998,676.7,"mly.prcp.normal",640,568,560,471,508,607,516,609,502,446,536,638,"Brevard ","Brevard ","NC ","Transylvania County ",35.229999999999997,-82.74,"COOP",1]
[null,null,null,"Tyrrell",null,null,null,null,{"$f":"+I29","v":413},{"$f":"+J29","v":305},431,313,392,501,518,569,464,344,348,{"$f":"+T29","v":399}]
[178,53872,"MONROE AP","Union ",35.016939999999998,-80.620559999999998,207,"mly.prcp.normal",374,360,384,302,299,417,419,462,356,368,318,320,"NA","NA","NA","Union County ","NA","NA","NA",1.5]
[null,null,null,"Vance",null,null,null,null,{"$f":"+I40","v":321},{"$f":"+J40","v":283},484,308,358,405,469,540,389,358,305,372,null,null,null,{"$f":"+D92","v":"Vance"}]
[84,317074,"RALEIGH 4 SW","Wake ",35.729399999999998,-78.683800000000005,128,"mly.prcp.normal",399,347,434,305,352,483,446,439,421,354,319,323,"Raleigh 4 Sw ","Raleigh ","NC ","Wake County ",35.729999999999997,-78.680000000000007,"COOP",3]
[2,310241,"ARCOLA","Warren ",36.2911,-77.982200000000006,100.6,"mly.prcp.normal",384,325,460,337,350,456,510,520,419,334,330,327,"Arcola ","Arcola ","NC ","Warren County ",36.29,-77.98,"COOP",3]
[83,316853,"PLYMOUTH 5 E","Washington ",35.872300000000003,-76.659199999999998,6.1,"mly.prcp.normal",394,330,437,333,419,519,534,628,539,375,353,329,"Plymouth 5 E ","Plymouth ","NC ","Washington County ",35.869999999999997,-76.66,"COOP",3]
[9,310982,"BOONE 1 SE","Watauga ",36.211399999999998,-81.644199999999998,1024.0999999999999,"mly.prcp.normal",389,390,466,449,462,506,473,507,441,356,449,378,"Boone 1 Se ","Boone ","NC ","Watauga County ",36.21,-81.64,"COOP",1]
[151,13713,"GOLDSBORO 4 SE","Wayne",35.3444,-77.964699999999993,33.200000000000003,"mly.prcp.normal",368,342,401,334,377,386,554,588,600,298,309,322,"NA","NA","NA","Wayne County","NA","NA","NA",3]
[79,316256,"NORTH WILKESBORO","Wilkes ",36.1631,-81.1494,341.4,"mly.prcp.normal",409,375,461,409,411,458,473,444,413,358,349,386,"North Wilkesboro ","North Wilkesboro ","NC ","Wilkes County ",36.159999999999997,-81.150000000000006,"COOP",1]
[120,319476,"WILSON 3 SW","Wilson ",35.693890000000003,-77.94556,33.5,"mly.prcp.normal",376,314,423,303,406,410,537,491,502,314,299,329,"Wilson 3 Sw ","Wilson ","NC ","Wilson County ",35.69,-77.95,"COOP",3]
[121,319675,"YADKINVILLE 6 E","Yadkin ",36.130600000000001,-80.548100000000005,266.7,"mly.prcp.normal",349,331,413,361,378,416,473,349,386,339,314,363,"Yadkinville 6 E ","Yadkinville ","NC ","Yadkin County ",36.130000000000003,-80.55,"COOP",1.5]
[19,311624,"CELO 2 S","Yancey ",35.829700000000003,-82.176900000000003,816.9,"mly.prcp.normal",511,502,552,450,497,471,467,532,499,382,467,456,"Celo 2 S ","Celo ","NC ","Yancey County ",35.83,-82.18,"COOP",1]

{"sheet":"ppt.events.5","index":5,"n_rows":116,"n_cols":27,"rows_kept":116,"cut":false,"hidden":false,"merged":[]}
[null,"coop.id","sta.name","County","lat.dec","long.dec","elev.m","variable",1,2,3,4,5,6,7,8,9,10,11,12,"Name","City","State","County","Lat","Long","Type"]
[12,311239,"BURLINGTON FIRE STN #5","Alamance ",36.060279999999999,-79.448059999999998,201.2,".avgnds.ge050hi",29,22,29,24,29,23,32,27,24,19,23,22,"Burlington Fire Stn #5 ","Burlington ","NC ","Alamance ",36.06,-79.45,"COOP"]
[null,null,null,"Alexander",null,null,null,null,{"$f":"+I19","v":26},{"$f":"+J19","v":25},29,25,24,27,33,27,24,21,23,27]
[null,null,null,"Alleghany",null,null,null,null,{"$f":"+I6","v":27},{"$f":"+J6","v":26},33,26,28,34,29,30,31,24,29,26]
[111,318964,"WADESBORO","Anson ",34.960299999999997,-80.077200000000005,146.30000000000001,".avgnds.ge050hi",27,24,29,20,23,28,37,28,26,21,23,23,"Wadesboro ","Wadesboro ","NC ","Anson ",34.96,-80.08,"COOP"]
[106,318694,"TRANSOU","Ashe ",36.3919,-81.303899999999999,876.3,".avgnds.ge050hi",27,26,33,26,28,34,29,30,31,24,29,26,"Transou ","Laurel Springs ","NC ","Ashe ",36.39,-81.3,"COOP"]
[5,310506,"BANNER ELK","Avery ",36.1616,-81.874099999999999,1149.0999999999999,".avgnds.ge050hi",27,27,25,28,30,36,36,33,27,20,19,22,"Banner Elk ","Banner Elk ","NC ","Avery ",36.159999999999997,-81.87,"COOP"]
[4,310375,"AURORA 6 N","Beaufort ",35.3872,-76.776300000000006,6.1,".avgnds.ge050hi",28,22,28,19,24,35,41,41,27,19,19,22,"Aurora 6 N ","Aurora ","NC ","Beaufort ",35.39,-76.78,"COOP"]
[61,314962,"LEWISTON","Bertie ",36.1325,-77.1708,15.2,".avgnds.ge050hi",23,23,27,21,23,26,38,36,30,19,23,25,"Lewiston ","Lewiston ","NC ","Bertie ",36.130000000000003,-77.17,"COOP"]
[null,null,null,"Bladen",null,null,null,null,28,25,29,24,28,34,43,40,35,20,19,21]
[64,315116,"LONGWOOD","Brunswick ",34.010199999999998,-78.545000000000002,12.2,".avgnds.ge050hi",29,21,27,21,24,35,35,43,33,24,22,24,"Longwood ","Longwood ","NC ","Brunswick ",34.01,-78.55,"COOP"]
[7,310724,"BENT CREEK","Buncombe ",35.504399999999997,-82.596599999999995,643.1,".avgnds.ge050hi",23,25,28,25,25,30,34,23,28,18,29,23,"Bent Creek ","Asheville ","NC ","Buncombe ",35.5,-82.6,"COOP"]
[11,311081,"BRIDGEWATER HYDRO","Burke ",35.7425,-81.837199999999996,350.5,".avgnds.ge050hi",28,27,26,26,26,31,30,28,27,21,25,26,"Bridgewater Hydro ","Bridgewater ","NC ","Burke ",35.74,-81.84,"COOP"]
[23,311975,"CONCORD","Cabarrus ",35.4163,-80.600499999999997,210.3,".avgnds.ge050hi",25,25,28,24,23,29,31,26,20,23,23,22,"Concord ","Concord ","NC ","Cabarrus ",35.42,-80.599999999999994,"COOP"]
[60,314938,"LENOIR","Caldwell ",35.914999999999999,-81.537700000000001,365.8,".avgnds.ge050hi",24,28,32,28,28,31,29,28,31,23,26,26,"Lenoir ","Lenoir ","NC ","Caldwell ",35.92,-81.540000000000006,"COOP"]
[null,null,null,"Camden",null,null,null,null,{"$f":"+I86","v":27},{"$f":"+J86","v":23},26,20,26,31,36,39,29,20,24,24]
[71,315830,"MOREHEAD CITY 2 WNW","Carteret ",34.733600000000003,-76.735699999999994,3,".avgnds.ge050hi",33,26,31,21,28,30,42,46,40,24,30,32,"Morehead City 2 Wnw ","Morehead City ","NC ","Carteret ",34.729999999999997,-76.739999999999995,"COOP"]
[187,319704,"YANCEYVILLE 4 SE","Caswell",36.378300000000003,-79.254400000000004,199.6,".avgnds.ge050hi",25,19,31,30,22,24,29,24,30,21,25,29,"NA","NA","NA","NA","NA","NA","NA"]
[175,3810,"HICKORY FAA AP","Catawba",35.7425,-81.381900000000002,348.4,".avgnds.ge050hi",26,25,29,25,24,27,33,27,24,21,23,27,"NA","NA","NA","NA","NA","NA","NA"]
[99,317924,"SILER CITY 2 N","Chatham ",35.760599999999997,-79.462199999999996,185.9,".avgnds.ge050hi",24,24,31,23,27,26,29,26,24,24,26,22,"Siler City 2 N ","Siler City ","NC ","Chatham ",35.76,-79.459999999999994,"COOP"]
[77,316001,"MURPHY","Cherokee ",35.096110000000003,-84.023889999999994,480.4,".avgnds.ge050hi",42,37,37,35,33,38,35,32,31,25,35,37,"Murphy ","Murphy ","NC ","Cherokee ",35.1,-84.02,"COOP"]
[31,312635,"EDENTON","Chowan ",36.016390000000001,-76.551670000000001,3,".avgnds.ge050hi",26,23,27,22,26,30,41,39,30,18,24,21,"Edenton ","Edenton ","NC ","Chowan ",36.020000000000003,-76.55,"COOP"]
[null,null,null,"Clay",null,null,null,null,{"$f":"+I21","v":42},{"$f":"+J21","v":37},37,35,33,38,35,32,31,25,35,37]
[98,317845,"SHELBY 2 NNE","Cleveland ",35.314399999999999,-81.533600000000007,280.39999999999998,".avgnds.ge050hi",29,27,34,27,27,27,26,26,23,23,27,30,"Shelby 2 Nne ","Shelby ","NC ","Cleveland ",35.31,-81.53,"COOP"]
[116,319357,"WHITEVILLE 7 NW","Columbus ",34.409399999999998,-78.791300000000007,27.4,".avgnds.ge050hi",27,23,25,22,27,30,37,40,28,19,20,21,"Whiteville 7 Nw ","Whiteville ","NC ","Columbus ",34.409999999999997,-78.790000000000006,"COOP"]
[160,93719,"NEW BERN - ASOS","Craven",35.067700000000002,-77.048000000000002,5.8,".avgnds.ge050hi",28,26,30,22,28,31,46,43,29,21,20,22,"NA","NA","NA","NA","NA","NA","NA"]
[37,313017,"FAYETTEVILLE PWC","Cumberland ",35.058300000000003,-78.8583,29.3,".avgnds.ge050hi",26,23,25,22,21,31,36,37,26,19,21,22,"Fayetteville Pwc ","Fayetteville ","NC ","Cumberland ",35.06,-78.86,"COOP"]
[null,null,null,"Currituck",null,null,null,null,{"$f":"+I86","v":27},{"$f":"+J86","v":23},26,20,26,31,36,39,29,20,24,24]
[183,13766,"MANTEO AP","Dare",35.917299999999997,-75.7,4,".avgnds.ge050hi",33,22,30,25,24,30,37,40,27,20,22,25,"NA","NA","NA","NA","NA","NA","NA"]
[62,314970,"LEXINGTON","Davidson ",35.845799999999997,-80.259699999999995,231.6,".avgnds.ge050hi",26,27,29,27,22,29,27,25,27,21,24,26,"Lexington ","Lexington ","NC ","Davidson ",35.85,-80.260000000000005,"COOP"]
[69,315743,"MOCKSVILLE 5SE","Davie ",35.843800000000002,-80.497200000000007,244.4,".avgnds.ge050hi",27,26,32,26,21,25,28,24,25,23,23,28,"Mocksville 5se ","Mocksville ","NC ","Davie ",35.840000000000003,-80.5,"COOP"]
[null,null,null,"Duplin",null,null,null,null,{"$f":"+I87","v":28},{"$f":"+J87","v":25},29,24,28,34,43,40,35,20,19,21]
[29,312515,"DURHAM","Durham ",36.042499999999997,-78.962500000000006,121.9,".avgnds.ge050hi",28,26,32,24,25,30,29,33,23,23,23,28,"Durham ","Durham ","NC ","Durham ",36.04,-78.959999999999994,"COOP"]
[92,317400,"ROCKY MT 8 ESE","Edgecombe ",35.893610000000002,-77.68056,33.5,".avgnds.ge050hi",25,25,30,26,22,28,31,32,27,20,20,23,"Rocky Mt 8 Ese ","Rocky Mount ","NC ","Edgecombe ",35.89,-77.680000000000007,"COOP"]
[null,null,null,"Forsyth",null,null,null,null,{"$f":"+I42","v":27},{"$f":"+J42","v":26},30,23,24,31,31,29,27,22,25,25]
[65,315123,"LOUISBURG","Franklin ",36.102800000000002,-78.303899999999999,79.2,".avgnds.ge050hi",23,20,30,20,26,26,30,36,27,20,23,24,"Louisburg ","Louisburg ","NC ","Franklin ",36.1,-78.3,"COOP"]
[41,313356,"GASTONIA","Gaston ",35.265500000000003,-81.143299999999996,213.4,".avgnds.ge050hi",29,25,27,22,22,25,20,30,23,24,20,27,"Gastonia ","Gastonia ","NC ","Gaston ",35.270000000000003,-81.14,"COOP"]
[null,null,null,"Gates",null,null,null,null,{"$f":"+I47","v":26},{"$f":"+J47","v":26},30,26,31,34,32,30,28,25,22,28]
[104,318492,"TAPOCO","Graham ",35.456110000000002,-83.939719999999994,338.3,".avgnds.ge050hi",31,35,36,31,37,41,38,25,25,18,35,35,"Tapoco ","Tapoco ","NC ","Graham ",35.46,-83.94,"COOP"]
[153,316510,"OXFORD AG","Granville",36.302219999999998,-78.610830000000007,152.4,".avgnds.ge050hi",22,19,29,27,26,27,29,28,26,19,22,28,"NA","NA","NA","NA","NA","NA","NA"]
[null,null,null,"Greene",null,null,null,null,{"$f":"+I55","v":27},{"$f":"+J55","v":24},27,21,25,34,37,33,30,17,24,24]
[48,314063,"HIGH POINT","Guilford ",35.967219999999998,-79.972219999999993,274.3,".avgnds.ge050hi",27,26,30,23,24,31,31,29,27,22,25,25,"High Point ","High Point ","NC ","Guilford ",35.97,-79.97,"COOP"]
[35,312827,"ENFIELD","Halifax ",36.168599999999998,-77.674999999999997,33.5,".avgnds.ge050hi",23,23,32,22,22,23,31,31,27,22,23,23,"Enfield ","Enfield ","NC ","Halifax ",36.17,-77.680000000000007,"COOP"]
[28,312500,"DUNN 4 NW","Harnett ",35.3247,-78.688100000000006,61,".avgnds.ge050hi",27,23,28,21,25,28,38,36,26,18,23,24,"Dunn 4 Nw ","Dunn ","NC ","Harnett ",35.32,-78.69,"COOP"]
[115,319147,"WAYNESVILLE 1 E","Haywood ",35.486600000000003,-82.968299999999999,810.2,".avgnds.ge050hi",30,30,29,29,29,28,23,26,24,16,28,27,"Waynesville 1 E ","Waynesville ","NC ","Haywood ",35.49,-82.97,"COOP"]
[38,313106,"FLETCHER 3 W","Henderson ",35.426600000000001,-82.557400000000001,630.9,".avgnds.ge050hi",31,28,29,22,25,32,31,29,28,23,24,29,"Fletcher 3 W ","Fletcher ","NC ","Henderson ",35.43,-82.56,"COOP"]
[76,315996,"MURFREESBORO","Hertford ",36.452100000000002,-77.080299999999994,30.5,".avgnds.ge050hi",26,26,30,26,31,34,32,30,28,25,22,28,"Murfreesboro ","Murfreesboro ","NC ","Hertford ",36.450000000000003,-77.08,"COOP"]
[132,317056,"RAEFORD","Hoke",34.987000000000002,-79.218999999999994,76.2,".avgnds.ge050hi",28,23,27,23,20,30,29,35,27,20,24,21,"NA","NA","NA","NA","NA","NA","NA"]
[null,null,null,"Hyde",null,null,null,null,{"$f":"+I29","v":33},{"$f":"+J29","v":22},30,25,24,30,37,40,27,20,22,25]
[103,318292,"STATESVILLE 2 NNE","Iredell ",35.809899999999999,-80.880799999999994,289.60000000000002,".avgnds.ge050hi",24,25,28,23,23,29,25,24,24,23,24,27,"Statesville 2 Nne ","Statesville ","NC ","Iredell ",35.81,-80.88,"COOP"]
[26,312200,"CULLOWHEE","Jackson ",35.311599999999999,-83.174700000000001,668.1,".avgnds.ge050hi",34,34,31,29,30,32,31,29,24,20,32,31,"Cullowhee ","Cullowhee ","NC ","Jackson ",35.31,-83.17,"COOP"]
[21,311820,"CLAYTON WTP","Johnston ",35.640799999999999,-78.463300000000004,91.4,".avgnds.ge050hi",28,24,34,21,23,28,35,39,26,19,22,24,"Clayton Wtp ","Clayton ","NC ","Johnston ",35.64,-78.459999999999994,"COOP"]
[107,318706,"TRENTON","Jones ",35.062779999999997,-77.35472,9.1,".avgnds.ge050hi",30,23,28,22,29,32,40,41,32,21,20,22,"Trenton ","Trenton ","NC ","Jones ",35.06,-77.349999999999994,"COOP"]
[97,317656,"SANFORD 8 NE","Lee ",35.534700000000001,-79.046400000000006,79.900000000000006,".avgnds.ge050hi",27,25,29,20,26,29,33,32,26,21,24,22,"Sanford 8 Ne ","Sanford ","NC ","Lee ",35.53,-79.05,"COOP"]
[56,314689,"KINSTON AG RSCH","Lenoir ",35.297499999999999,-77.572199999999995,18.3,".avgnds.ge050hi",27,24,27,21,25,34,37,33,30,17,24,24,"Kinston Ag Rsch ","Kinston ","NC ","Lenoir ",35.299999999999997,-77.569999999999993,"COOP"]
[63,314996,"LINCOLNTON 4 W","Lincoln ",35.460560000000001,-81.328890000000001,274.3,".avgnds.ge050hi",26,26,31,26,27,30,26,25,23,27,24,28,"Lincolnton 4 W ","Lincolnton ","NC ","Lincoln ",35.46,-81.33,"COOP"]
[25,312102,"COWEETA EXP STN","Macon ",35.059100000000001,-83.431299999999993,685.5,".avgnds.ge050hi",41,44,42,35,33,37,32,30,31,29,39,44,"Coweeta Exp Stn ","Coweeta ","NC ","Macon ",35.06,-83.43,"COOP"]
[51,314260,"HOT SPRINGS","Madison ",35.895000000000003,-82.831109999999995,425.5,".avgnds.ge050hi",20,21,23,24,31,29,35,30,25,13,17,16,"Hot Springs ","Hot Springs ","NC ","Madison ",35.9,-82.83,"COOP"]
[118,319440,"WILLIAMSTON 1 E","Martin ",35.852899999999998,-77.030600000000007,6.1,".avgnds.ge050hi",28,22,28,26,28,29,32,40,31,22,21,25,"Williamston 1 E ","Williamston ","NC ","Martin ",35.85,-77.03,"COOP"]
[67,315340,"MARION 2 NW","Mcdowell ",35.662999999999997,-82.0291,446.8,".avgnds.ge050hi",25,28,31,29,30,33,31,30,32,21,27,28,"Marion 2 Nw ","Marion ","NC ","Mcdowell ",35.659999999999997,-82.03,"COOP"]
[144,13881,"CHARLOTTE DOUGLAS AP","Mecklenburg",35.223599999999998,-80.955200000000005,221.9,".avgnds.ge050hi",23,23,30,23,20,27,23,26,23,20,25,23,"NA","NA","NA","NA","NA","NA","NA"]
[null,null,null,"Mitchell",null,null,null,null,{"$f":"+I116","v":33},{"$f":"+J116","v":32},35,31,34,32,29,30,26,23,31,29]
[53,314464,"JACKSON SPRINGS 5 WNW","Montgomery ",35.1858,-79.677199999999999,222.5,".avgnds.ge050hi",26,25,28,22,19,27,32,33,24,21,24,25,"Jackson Springs 5 Wnw ","Jackson Springs ","NC ","Montgomery ",35.19,-79.680000000000007,"COOP"]
[14,311515,"CARTHAGE WTP","Moore ",35.332000000000001,-79.406599999999997,134.1,".avgnds.ge050hi",29,25,29,19,21,30,34,33,25,20,22,25,"Carthage Wtp ","Carthage ","NC ","Moore ",35.33,-79.41,"COOP"]
[126,13872,"ASHEVILLE","NA",35.595399999999998,-82.556799999999996,682.1,".avgnds.ge050hi",19,19,20,23,19,23,19,22,20,13,19,19,"NA","NA","NA","NA","NA","NA","NA"]
[129,3812,"ASHEVILLE AP","NA",35.431939999999997,-82.537499999999994,645.29999999999995,".avgnds.ge050hi",25,24,25,25,22,31,30,25,27,21,24,24,"NA","NA","NA","NA","NA","NA","NA"]
[145,311420,"CANDLER 1W","NA",35.545279999999998,-82.698610000000002,718.4,".avgnds.ge050hi",27,19,27,25,23,29,24,31,25,12,21,19,"NA","NA","NA","NA","NA","NA","NA"]
[146,311437,"CANTO","NA",35.7044,-82.7697,620.9,".avgnds.ge050hi",24,23,27,25,23,34,31,26,24,12,15,18,"NA","NA","NA","NA","NA","NA","NA"]
[147,93729,"CAPE HATTERAS AP","NA",35.232599999999998,-75.621899999999997,3.4,".avgnds.ge050hi",34,28,31,26,23,28,31,39,34,30,30,30,"NA","NA","NA","NA","NA","NA","NA"]
[158,13754,"CHERRY POINT MCAS","NA",34.9,-76.883330000000001,8.8000000000000007,".avgnds.ge050hi",28,25,28,21,30,33,49,44,36,22,23,25,"NA","NA","NA","NA","NA","NA","NA"]
[161,13786,"ELIZABETH CITY CGAS","NA",36.260559999999998,-76.174999999999997,4,".avgnds.ge050hi",16,20,25,19,28,32,33,34,25,16,21,20,"NA","NA","NA","NA","NA","NA","NA"]
[181,13714,"FAYETTEVILLE POPE AFB","NA",35.17389,-79.008889999999994,66.400000000000006,".avgnds.ge050hi",27,25,30,20,20,32,35,31,25,22,21,20,"NA","NA","NA","NA","NA","NA","NA"]
[154,13723,"GREENSBORO  AP","NA",36.083329999999997,-79.95,271.3,".avgnds.ge050hi",23,20,25,24,24,27,29,23,29,22,21,22,"NA","NA","NA","NA","NA","NA","NA"]
[125,316349,"OCRACOKE","NA",35.107500000000002,-75.987200000000001,1.2,".avgnds.ge050hi",25,26,23,27,24,26,31,40,42,26,22,29,"NA","NA","NA","NA","NA","NA","NA"]
[133,13722,"RALEIGH  AP","NA",35.866669999999999,-78.783330000000007,126.8,".avgnds.ge050hi",23,23,30,18,24,23,34,25,28,19,23,22,"NA","NA","NA","NA","NA","NA","NA"]
[188,317725,"SCOTLAND NECK #2","NA",36.136899999999997,-77.423100000000005,30.5,".avgnds.ge050hi",26,20,30,24,24,29,34,33,31,19,20,26,"NA","NA","NA","NA","NA","NA","NA"]
[167,319354,"WHITEVILLE 5 S","NA",34.257199999999997,-78.687200000000004,15.2,".avgnds.ge050hi",29,24,24,21,26,32,38,39,34,22,27,23,"NA","NA","NA","NA","NA","NA","NA"]
[180,13748,"WILMINGTON INTL AP","NA",34.267499999999998,-77.899699999999996,10.1,".avgnds.ge050hi",26,26,28,15,25,34,45,44,37,22,20,25,"NA","NA","NA","NA","NA","NA","NA"]
[166,319923,"ZEBULON 3 SW","NA",35.787799999999997,-78.349699999999999,79.2,".avgnds.ge050hi",28,22,33,23,26,24,33,35,26,21,28,24,"NA","NA","NA","NA","NA","NA","NA"]
[91,317395,"ROCKY MOUNT","Nash ",35.951999999999998,-77.818399999999997,39.6,".avgnds.ge050hi",24,23,30,23,22,27,33,36,24,21,19,26,"Rocky Mount ","Rocky Mount ","NC ","Nash ",35.950000000000003,-77.819999999999993,"COOP"]
[119,319467,"WILMINGTON 7 N","New Hanover ",34.320799999999998,-77.920500000000004,12.2,".avgnds.ge050hi",29,25,28,19,26,33,48,43,39,22,20,26,"Wilmington 7 N ","Wilmington ","NC ","New Hanover ",34.32,-77.92,"COOP"]
[52,314456,"JACKSON","Northampton ",36.396700000000003,-77.423900000000003,39.6,".avgnds.ge050hi",25,20,32,22,28,25,34,34,25,20,21,22,"Jackson ","Jackson ","NC ","Northampton ",36.4,-77.42,"COOP"]
[50,314144,"HOFMANN FOREST","Onslow ",34.835799999999999,-77.302999999999997,14.3,".avgnds.ge050hi",32,25,30,22,28,35,44,50,33,21,23,24,"Hofmann Forest ","Maysville ","NC ","Onslow ",34.840000000000003,-77.3,"COOP"]
[20,311677,"CHAPEL HILL 2 W","Orange ",35.9086,-79.079400000000007,152.4,".avgnds.ge050hi",27,27,30,22,26,26,30,29,25,23,25,24,"Chapel Hill 2 W ","Chapel Hill ","NC ","Orange ",35.909999999999997,-79.08,"COOP"]
[6,310576,"BAYBORO 3 SW","Pamlico ",35.131100000000004,-76.816000000000003,1.5,".avgnds.ge050hi",27,22,29,24,29,37,43,44,34,25,22,23,"Bayboro 3 Sw ","Bayboro ","NC ","Pamlico ",35.130000000000003,-76.819999999999993,"COOP"]
[32,312719,"ELIZABETH CITY","Pasquotank ",36.309719999999999,-76.204999999999998,2.4,".avgnds.ge050hi",27,23,26,20,26,31,36,39,29,20,24,24,"Elizabeth City ","Elizabeth City ","NC ","Pasquotank ",36.31,-76.209999999999994,"COOP"]
[117,319423,"WILLARD 4 SW","Pender ",34.661200000000001,-78.045500000000004,16.8,".avgnds.ge050hi",28,25,29,24,28,34,43,40,35,20,19,21,"Willard 4 Sw ","Willard ","NC ","Pender ",34.659999999999997,-78.05,"COOP"]
[null,null,null,"Perquimans",null,null,null,null,{"$f":"+I86","v":27},{"$f":"+J86","v":23},26,20,26,31,36,39,29,20,24,24]
[94,317516,"ROXBORO 7 ESE","Person ",36.346400000000003,-78.885800000000003,216.4,".avgnds.ge050hi",26,24,33,26,22,24,31,27,23,25,26,28,"Roxboro 7 Ese ","Roxboro ","NC ","Person ",36.35,-78.89,"COOP"]
[44,313638,"GREENVILLE","Pitt ",35.64,-77.398399999999995,9.8000000000000007,".avgnds.ge050hi",27,24,30,22,25,28,38,36,31,19,24,23,"Greenville ","Greenville ","NC ","Pitt ",35.64,-77.400000000000006,"COOP"]
[108,318744,"TRYON","Polk ",35.205800000000004,-82.251599999999996,365.8,".avgnds.ge050hi",34,35,37,32,29,35,33,31,32,28,29,36,"Tryon ","Tryon ","NC ","Polk ",35.21,-82.25,"COOP"]
[3,310286,"ASHEBORO 2 W","Randolph ",35.704439999999998,-79.837779999999995,265.2,".avgnds.ge050hi",25,27,32,24,26,26,27,26,26,22,24,22,"Asheboro 2 W ","Asheboro ","NC ","Randolph ",35.700000000000003,-79.84,"COOP"]
[null,null,null,"Richmond ",null,null,null,null,{"$f":"+I99","v":26},{"$f":"+J99","v":27},28,20,23,31,33,34,27,21,20,21]
[66,315177,"LUMBERTON","Robeson ",34.626899999999999,-79.025000000000006,34.1,".avgnds.ge050hi",27,26,27,24,23,30,43,39,26,19,23,21,"Lumberton ","Lumberton ","NC ","Robeson ",34.630000000000003,-79.03,"COOP"]
[88,317202,"REIDSVILLE 2 NW","Rockingham ",36.3825,-79.694699999999997,271.3,".avgnds.ge050hi",27,26,29,26,24,27,33,23,24,22,25,25,"Reidsville 2 Nw ","Reidsville ","NC ","Rockingham ",36.380000000000003,-79.69,"COOP"]
[96,317618,"SALISBURY 9 WNW","Rowan ",35.696599999999997,-80.622699999999995,251.5,".avgnds.ge050hi",26,24,30,24,21,27,23,25,27,20,19,24,"Salisbury 9 Wnw ","Salisbury ","NC ","Rowan ",35.700000000000003,-80.62,"COOP"]
[57,314764,"LAKE LURE 2","Rutherford ",35.420499999999997,-82.187700000000007,317,".avgnds.ge050hi",31,28,28,28,24,31,24,33,26,25,26,24,"Lake Lure 2 ","Lake Lure ","NC ","Rutherford ",35.42,-82.19,"COOP"]
[22,311881,"CLINTON 2 NE","Sampson ",35.024700000000003,-78.275800000000004,48.2,".avgnds.ge050hi",25,21,23,19,23,32,38,36,28,17,20,26,"Clinton 2 Ne ","Clinton ","NC ","Sampson ",35.020000000000003,-78.28,"COOP"]
[59,314860,"LAURINBURG","Scotland ",34.750799999999998,-79.466399999999993,64,".avgnds.ge050hi",26,27,28,20,23,31,33,34,27,21,20,21,"Laurinburg ","Laurinburg ","NC ","Scotland ",34.75,-79.47,"COOP"]
[1,310090,"ALBEMARLE","Stanly ",35.399169999999998,-80.199439999999996,185.9,".avgnds.ge050hi",25,26,34,22,26,32,36,27,25,22,24,24,"Albemarle ","Albemarle ","NC ","Stanly ",35.4,-80.2,"COOP"]
[27,312238,"DANBURY","Stokes ",36.414700000000003,-80.216899999999995,256,".avgnds.ge050hi",24,23,31,25,31,29,36,24,29,23,21,27,"Danbury ","Danbury ","NC ","Stokes ",36.409999999999997,-80.22,"COOP"]
[34,312740,"ELKIN","Surry ",36.254399999999997,-80.864999999999995,265.2,".avgnds.ge050hi",25,24,30,26,24,28,34,26,27,21,21,26,"Elkin ","Elkin ","NC ","Surry ",36.25,-80.87,"COOP"]
[80,316341,"OCONALUFTEE","Swain ",35.5261,-83.308899999999994,621.79999999999995,".avgnds.ge050hi",35,34,34,28,36,32,31,26,29,19,32,33,"Oconaluftee ","Oconaluftee ","NC ","Swain ",35.53,-83.31,"COOP"]
[10,311055,"BREVARD","Transylvania ",35.228299999999997,-82.735799999999998,676.7,".avgnds.ge050hi",37,38,36,31,34,43,37,37,32,32,35,42,"Brevard ","Brevard ","NC ","Transylvania ",35.229999999999997,-82.74,"COOP"]
[null,null,null,"Tyrrell",null,null,null,null,{"$f":"+I29","v":33},{"$f":"+J29","v":22},30,25,24,30,37,40,27,20,22,25]
[70,315771,"MONROE 2 SE","Union ",34.97972,-80.523330000000001,167.6,".avgnds.ge050hi",30,26,29,22,22,30,30,32,24,27,24,25,"Monroe 2 Se ","Monroe ","NC ","Union ",34.979999999999997,-80.52,"COOP"]
[46,313969,"HENDERSON 2 NNW","Vance ",36.348100000000002,-78.411900000000003,146.30000000000001,".avgnds.ge050hi",28,20,29,26,27,31,33,27,24,21,25,26,"Henderson 2 Nnw ","Henderson ","NC ","Vance ",36.35,-78.41,"COOP"]
[84,317074,"RALEIGH 4 SW","Wake ",35.729399999999998,-78.683800000000005,128,".avgnds.ge050hi",29,28,32,20,26,32,34,30,26,24,26,22,"Raleigh 4 Sw ","Raleigh ","NC ","Wake ",35.729999999999997,-78.680000000000007,"COOP"]
[2,310241,"ARCOLA","Warren ",36.2911,-77.982200000000006,100.6,".avgnds.ge050hi",26,23,36,25,25,30,35,35,26,23,26,25,"Arcola ","Arcola ","NC ","Warren ",36.29,-77.98,"COOP"]
[83,316853,"PLYMOUTH 5 E","Washington ",35.872300000000003,-76.659199999999998,6.1,".avgnds.ge050hi",27,25,30,25,26,34,37,42,31,19,23,22,"Plymouth 5 E ","Plymouth ","NC ","Washington ",35.869999999999997,-76.66,"COOP"]
[9,310982,"BOONE 1 SE","Watauga ",36.211399999999998,-81.644199999999998,1024.0999999999999,".avgnds.ge050hi",21,27,30,30,30,33,34,32,27,19,28,22,"Boone 1 Se ","Boone ","NC ","Watauga ",36.21,-81.64,"COOP"]
[151,13713,"GOLDSBORO 4 SE","Wayne",35.3444,-77.964699999999993,33.200000000000003,".avgnds.ge050hi",29,27,29,25,25,28,32,40,33,19,19,19,"NA","NA","NA","NA","NA","NA","NA"]
[79,316256,"NORTH WILKESBORO","Wilkes ",36.1631,-81.1494,341.4,".avgnds.ge050hi",29,27,35,30,26,31,35,26,30,24,27,27,"North Wilkesboro ","North Wilkesboro ","NC ","Wilkes ",36.159999999999997,-81.150000000000006,"COOP"]
[120,319476,"WILSON 3 SW","Wilson ",35.693890000000003,-77.94556,33.5,".avgnds.ge050hi",28,24,31,20,28,26,35,33,30,20,23,24,"Wilson 3 Sw ","Wilson ","NC ","Wilson ",35.69,-77.95,"COOP"]
[121,319675,"YADKINVILLE 6 E","Yadkin ",36.130600000000001,-80.548100000000005,266.7,".avgnds.ge050hi",26,24,30,24,23,29,34,21,27,22,22,28,"Yadkinville 6 E ","Yadkinville ","NC ","Yadkin ",36.130000000000003,-80.55,"COOP"]
[19,311624,"CELO 2 S","Yancey ",35.829700000000003,-82.176900000000003,816.9,".avgnds.ge050hi",33,32,35,31,34,32,29,30,26,23,31,29,"Celo 2 S ","Celo ","NC ","Yancey ",35.83,-82.18,"COOP"]

{"sheet":"ET.county","index":6,"n_rows":101,"n_cols":14,"rows_kept":101,"cut":false,"hidden":false,"merged":[]}
["County","ET Region",1,2,3,4,5,6,7,8,9,10,11,12]
["Alamance ","Raleigh",{"$f":"INDEX(ET.region!$A$51:$M$61,MATCH(ET.county!$B2,ET.region!$A$51:$A$61,0),MATCH(ET.county!C$1,ET.region!$A$51:$M$51,0))","v":1.562204724409449},{"$f":"INDEX(ET.region!$A$51:$M$61,MATCH(ET.county!$B2,ET.region!$A$51:$A$61,0),MATCH(ET.county!D$1,ET.region!$A$51:$M$51,0))","v":2.0503937007874016},{"$f":"INDEX(ET.region!$A$51:$M$61,MATCH(ET.county!$B2,ET.region!$A$51:$A$61,0),MATCH(ET.county!E$1,ET.region!$A$51:$M$51,0))","v":3.5027559055118114},{"$f":"INDEX(ET.region!$A$51:$M$61,MATCH(ET.county!$B2,ET.region!$A$51:$A$61,0),MATCH(ET.county!F$1,ET.region!$A$51:$M$51,0))","v":4.9370078740157481},{"$f":"INDEX(ET.region!$A$51:$M$61,MATCH(ET.county!$B2,ET.region!$A$51:$A$61,0),MATCH(ET.county!G$1,ET.region!$A$51:$M$51,0))","v":6.2122047244094487},{"$f":"INDEX(ET.region!$A$51:$M$61,MATCH(ET.county!$B2,ET.region!$A$51:$A$61,0),MATCH(ET.county!H$1,ET.region!$A$51:$M$51,0))","v":6.6968503937007879},{"$f":"INDEX(ET.region!$A$51:$M$61,MATCH(ET.county!$B2,ET.region!$A$51:$A$61,0),MATCH(ET.county!I$1,ET.region!$A$51:$M$51,0))","v":6.9444881889763792},{"$f":"INDEX(ET.region!$A$51:$M$61,MATCH(ET.county!$B2,ET.region!$A$51:$A$61,0),MATCH(ET.county!J$1,ET.region!$A$51:$M$51,0))","v":6.2122047244094487},{"$f":"INDEX(ET.region!$A$51:$M$61,MATCH(ET.county!$B2,ET.region!$A$51:$A$61,0),MATCH(ET.county!K$1,ET.region!$A$51:$M$51,0))","v":4.7598425196850407},{"$f":"INDEX(ET.region!$A$51:$M$61,MATCH(ET.county!$B2,ET.region!$A$51:$A$61,0),MATCH(ET.county!L$1,ET.region!$A$51:$M$51,0))","v":3.4417322834645669},{"$f":"INDEX(ET.region!$A$51:$M$61,MATCH(ET.county!$B2,ET.region!$A$51:$A$61,0),MATCH(ET.county!M$1,ET.region!$A$51:$M$51,0))","v":2.1496062992125986},{"$f":"INDEX(ET.region!$A$51:$M$61,MATCH(ET.county!$B2,ET.region!$A$51:$A$61,0),MATCH(ET.county!N$1,ET.region!$A$51:$M$51,0))","v":1.5133858267716536}]
["Alexander","Lenoir",{"$f":"INDEX(ET.region!$A$51:$M$61,MATCH(ET.county!$B3,ET.region!$A$51:$A$61,0),MATCH(ET.county!C$1,ET.region!$A$51:$M$51,0))","v":1.4523622047244096},{"$f":"INDEX(ET.region!$A$51:$M$61,MATCH(ET.county!$B3,ET.region!$A$51:$A$61,0),MATCH(ET.county!D$1,ET.region!$A$51:$M$51,0))","v":1.8850393700787402},{"$f":"INDEX(ET.region!$A$51:$M$61,MATCH(ET.county!$B3,ET.region!$A$51:$A$61,0),MATCH(ET.county!E$1,ET.region!$A$51:$M$51,0))","v":3.1610236220472441},{"$f":"INDEX(ET.region!$A$51:$M$61,MATCH(ET.county!$B3,ET.region!$A$51:$A$61,0),MATCH(ET.county!F$1,ET.region!$A$51:$M$51,0))","v":4.346456692913387},{"$f":"INDEX(ET.region!$A$51:$M$61,MATCH(ET.county!$B3,ET.region!$A$51:$A$61,0),MATCH(ET.county!G$1,ET.region!$A$51:$M$51,0))","v":5.333464566929135},{"$f":"INDEX(ET.region!$A$51:$M$61,MATCH(ET.county!$B3,ET.region!$A$51:$A$61,0),MATCH(ET.county!H$1,ET.region!$A$51:$M$51,0))","v":5.5748031496062991},{"$f":"INDEX(ET.region!$A$51:$M$61,MATCH(ET.county!$B3,ET.region!$A$51:$A$61,0),MATCH(ET.county!I$1,ET.region!$A$51:$M$51,0))","v":5.6751968503937018},{"$f":"INDEX(ET.region!$A$51:$M$61,MATCH(ET.county!$B3,ET.region!$A$51:$A$61,0),MATCH(ET.county!J$1,ET.region!$A$51:$M$51,0))","v":5.0893700787401581},{"$f":"INDEX(ET.region!$A$51:$M$61,MATCH(ET.county!$B3,ET.region!$A$51:$A$61,0),MATCH(ET.county!K$1,ET.region!$A$51:$M$51,0))","v":4.015748031496063},{"$f":"INDEX(ET.region!$A$51:$M$61,MATCH(ET.county!$B3,ET.region!$A$51:$A$61,0),MATCH(ET.county!L$1,ET.region!$A$51:$M$51,0))","v":3.0633858267716536},{"$f":"INDEX(ET.region!$A$51:$M$61,MATCH(ET.county!$B3,ET.region!$A$51:$A$61,0),MATCH(ET.county!M$1,ET.region!$A$51:$M$51,0))","v":1.9606299212598426},{"$f":"INDEX(ET.region!$A$51:$M$61,MATCH(ET.county!$B3,ET.region!$A$51:$A$61,0),MATCH(ET.county!N$1,ET.region!$A$51:$M$51,0))","v":1.3913385826771654}]
["Alleghany","Fletcher",{"$f":"INDEX(ET.region!$A$51:$M$61,MATCH(ET.county!$B4,ET.region!$A$51:$A$61,0),MATCH(ET.county!C$1,ET.region!$A$51:$M$51,0))","v":1.3913385826771654},{"$f":"INDEX(ET.region!$A$51:$M$61,MATCH(ET.county!$B4,ET.region!$A$51:$A$61,0),MATCH(ET.county!D$1,ET.region!$A$51:$M$51,0))","v":1.7748031496062995},{"$f":"INDEX(ET.region!$A$51:$M$61,MATCH(ET.county!$B4,ET.region!$A$51:$A$61,0),MATCH(ET.county!E$1,ET.region!$A$51:$M$51,0))","v":3.0633858267716536},{"$f":"INDEX(ET.region!$A$51:$M$61,MATCH(ET.county!$B4,ET.region!$A$51:$A$61,0),MATCH(ET.county!F$1,ET.region!$A$51:$M$51,0))","v":4.4173228346456694},{"$f":"INDEX(ET.region!$A$51:$M$61,MATCH(ET.county!$B4,ET.region!$A$51:$A$61,0),MATCH(ET.county!G$1,ET.region!$A$51:$M$51,0))","v":5.7362204724409454},{"$f":"INDEX(ET.region!$A$51:$M$61,MATCH(ET.county!$B4,ET.region!$A$51:$A$61,0),MATCH(ET.county!H$1,ET.region!$A$51:$M$51,0))","v":6.3070866141732287},{"$f":"INDEX(ET.region!$A$51:$M$61,MATCH(ET.county!$B4,ET.region!$A$51:$A$61,0),MATCH(ET.county!I$1,ET.region!$A$51:$M$51,0))","v":6.5417322834645679},{"$f":"INDEX(ET.region!$A$51:$M$61,MATCH(ET.county!$B4,ET.region!$A$51:$A$61,0),MATCH(ET.county!J$1,ET.region!$A$51:$M$51,0))","v":5.9314960629921272},{"$f":"INDEX(ET.region!$A$51:$M$61,MATCH(ET.county!$B4,ET.region!$A$51:$A$61,0),MATCH(ET.county!K$1,ET.region!$A$51:$M$51,0))","v":4.5118110236220472},{"$f":"INDEX(ET.region!$A$51:$M$61,MATCH(ET.county!$B4,ET.region!$A$51:$A$61,0),MATCH(ET.county!L$1,ET.region!$A$51:$M$51,0))","v":3.270866141732284},{"$f":"INDEX(ET.region!$A$51:$M$61,MATCH(ET.county!$B4,ET.region!$A$51:$A$61,0),MATCH(ET.county!M$1,ET.region!$A$51:$M$51,0))","v":1.9724409448818898},{"$f":"INDEX(ET.region!$A$51:$M$61,MATCH(ET.county!$B4,ET.region!$A$51:$A$61,0),MATCH(ET.county!N$1,ET.region!$A$51:$M$51,0))","v":1.3547244094488189}]
["Anson ","Jackson.Springs",{"$f":"INDEX(ET.region!$A$51:$M$61,MATCH(ET.county!$B5,ET.region!$A$51:$A$61,0),MATCH(ET.county!C$1,ET.region!$A$51:$M$51,0))","v":1.5011811023622048},{"$f":"INDEX(ET.region!$A$51:$M$61,MATCH(ET.county!$B5,ET.region!$A$51:$A$61,0),MATCH(ET.county!D$1,ET.region!$A$51:$M$51,0))","v":1.9622047244094489},{"$f":"INDEX(ET.region!$A$51:$M$61,MATCH(ET.county!$B5,ET.region!$A$51:$A$61,0),MATCH(ET.county!E$1,ET.region!$A$51:$M$51,0))","v":3.4051181102362205},{"$f":"INDEX(ET.region!$A$51:$M$61,MATCH(ET.county!$B5,ET.region!$A$51:$A$61,0),MATCH(ET.county!F$1,ET.region!$A$51:$M$51,0))","v":4.8661417322834648},{"$f":"INDEX(ET.region!$A$51:$M$61,MATCH(ET.county!$B5,ET.region!$A$51:$A$61,0),MATCH(ET.county!G$1,ET.region!$A$51:$M$51,0))","v":6.1755905511811022},{"$f":"INDEX(ET.region!$A$51:$M$61,MATCH(ET.county!$B5,ET.region!$A$51:$A$61,0),MATCH(ET.county!H$1,ET.region!$A$51:$M$51,0))","v":6.7440944881889759},{"$f":"INDEX(ET.region!$A$51:$M$61,MATCH(ET.county!$B5,ET.region!$A$51:$A$61,0),MATCH(ET.county!I$1,ET.region!$A$51:$M$51,0))","v":7.0055118110236227},{"$f":"INDEX(ET.region!$A$51:$M$61,MATCH(ET.county!$B5,ET.region!$A$51:$A$61,0),MATCH(ET.county!J$1,ET.region!$A$51:$M$51,0))","v":6.2244094488188981},{"$f":"INDEX(ET.region!$A$51:$M$61,MATCH(ET.county!$B5,ET.region!$A$51:$A$61,0),MATCH(ET.county!K$1,ET.region!$A$51:$M$51,0))","v":4.771653543307087},{"$f":"INDEX(ET.region!$A$51:$M$61,MATCH(ET.county!$B5,ET.region!$A$51:$A$61,0),MATCH(ET.county!L$1,ET.region!$A$51:$M$51,0))","v":3.4051181102362205},{"$f":"INDEX(ET.region!$A$51:$M$61,MATCH(ET.county!$B5,ET.region!$A$51:$A$61,0),MATCH(ET.county!M$1,ET.region!$A$51:$M$51,0))","v":2.0905511811023625},{"$f":"INDEX(ET.region!$A$51:$M$61,MATCH(ET.county!$B5,ET.region!$A$51:$A$61,0),MATCH(ET.county!N$1,ET.region!$A$51:$M$51,0))","v":1.4889763779527558}]
["Ashe ","Fletcher",{"$f":"INDEX(ET.region!$A$51:$M$61,MATCH(ET.county!$B6,ET.region!$A$51:$A$61,0),MATCH(ET.county!C$1,ET.region!$A$51:$M$51,0))","v":1.3913385826771654},{"$f":"INDEX(ET.region!$A$51:$M$61,MATCH(ET.county!$B6,ET.region!$A$51:$A$61,0),MATCH(ET.county!D$1,ET.region!$A$51:$M$51,0))","v":1.7748031496062995},{"$f":"INDEX(ET.region!$A$51:$M$61,MATCH(ET.county!$B6,ET.region!$A$51:$A$61,0),MATCH(ET.county!E$1,ET.region!$A$51:$M$51,0))","v":3.0633858267716536},{"$f":"INDEX(ET.region!$A$51:$M$61,MATCH(ET.county!$B6,ET.region!$A$51:$A$61,0),MATCH(ET.county!F$1,ET.region!$A$51:$M$51,0))","v":4.4173228346456694},{"$f":"INDEX(ET.region!$A$51:$M$61,MATCH(ET.county!$B6,ET.region!$A$51:$A$61,0),MATCH(ET.county!G$1,ET.region!$A$51:$M$51,0))","v":5.7362204724409454},{"$f":"INDEX(ET.region!$A$51:$M$61,MATCH(ET.county!$B6,ET.region!$A$51:$A$61,0),MATCH(ET.county!H$1,ET.region!$A$51:$M$51,0))","v":6.3070866141732287},{"$f":"INDEX(ET.region!$A$51:$M$61,MATCH(ET.county!$B6,ET.region!$A$51:$A$61,0),MATCH(ET.county!I$1,ET.region!$A$51:$M$51,0))","v":6.5417322834645679},{"$f":"INDEX(ET.region!$A$51:$M$61,MATCH(ET.county!$B6,ET.region!$A$51:$A$61,0),MATCH(ET.county!J$1,ET.region!$A$51:$M$51,0))","v":5.9314960629921272},{"$f":"INDEX(ET.region!$A$51:$M$61,MATCH(ET.county!$B6,ET.region!$A$51:$A$61,0),MATCH(ET.county!K$1,ET.region!$A$51:$M$51,0))","v":4.5118110236220472},{"$f":"INDEX(ET.region!$A$51:$M$61,MATCH(ET.county!$B6,ET.region!$A$51:$A$61,0),MATCH(ET.county!L$1,ET.region!$A$51:$M$51,0))","v":3.270866141732284},{"$f":"INDEX(ET.region!$A$51:$M$61,MATCH(ET.county!$B6,ET.region!$A$51:$A$61,0),MATCH(ET.county!M$1,ET.region!$A$51:$M$51,0))","v":1.9724409448818898},{"$f":"INDEX(ET.region!$A$51:$M$61,MATCH(ET.county!$B6,ET.region!$A$51:$A$61,0),MATCH(ET.county!N$1,ET.region!$A$51:$M$51,0))","v":1.3547244094488189}]
["Avery ","Fletcher",{"$f":"INDEX(ET.region!$A$51:$M$61,MATCH(ET.county!$B7,ET.region!$A$51:$A$61,0),MATCH(ET.county!C$1,ET.region!$A$51:$M$51,0))","v":1.3913385826771654},{"$f":"INDEX(ET.region!$A$51:$M$61,MATCH(ET.county!$B7,ET.region!$A$51:$A$61,0),MATCH(ET.county!D$1,ET.region!$A$51:$M$51,0))","v":1.7748031496062995},{"$f":"INDEX(ET.region!$A$51:$M$61,MATCH(ET.county!$B7,ET.region!$A$51:$A$61,0),MATCH(ET.county!E$1,ET.region!$A$51:$M$51,0))","v":3.0633858267716536},{"$f":"INDEX(ET.region!$A$51:$M$61,MATCH(ET.county!$B7,ET.region!$A$51:$A$61,0),MATCH(ET.county!F$1,ET.region!$A$51:$M$51,0))","v":4.4173228346456694},{"$f":"INDEX(ET.region!$A$51:$M$61,MATCH(ET.county!$B7,ET.region!$A$51:$A$61,0),MATCH(ET.county!G$1,ET.region!$A$51:$M$51,0))","v":5.7362204724409454},{"$f":"INDEX(ET.region!$A$51:$M$61,MATCH(ET.county!$B7,ET.region!$A$51:$A$61,0),MATCH(ET.county!H$1,ET.region!$A$51:$M$51,0))","v":6.3070866141732287},{"$f":"INDEX(ET.region!$A$51:$M$61,MATCH(ET.county!$B7,ET.region!$A$51:$A$61,0),MATCH(ET.county!I$1,ET.region!$A$51:$M$51,0))","v":6.5417322834645679},{"$f":"INDEX(ET.region!$A$51:$M$61,MATCH(ET.county!$B7,ET.region!$A$51:$A$61,0),MATCH(ET.county!J$1,ET.region!$A$51:$M$51,0))","v":5.9314960629921272},{"$f":"INDEX(ET.region!$A$51:$M$61,MATCH(ET.county!$B7,ET.region!$A$51:$A$61,0),MATCH(ET.county!K$1,ET.region!$A$51:$M$51,0))","v":4.5118110236220472},{"$f":"INDEX(ET.region!$A$51:$M$61,MATCH(ET.county!$B7,ET.region!$A$51:$A$61,0),MATCH(ET.county!L$1,ET.region!$A$51:$M$51,0))","v":3.270866141732284},{"$f":"INDEX(ET.region!$A$51:$M$61,MATCH(ET.county!$B7,ET.region!$A$51:$A$61,0),MATCH(ET.county!M$1,ET.region!$A$51:$M$51,0))","v":1.9724409448818898},{"$f":"INDEX(ET.region!$A$51:$M$61,MATCH(ET.county!$B7,ET.region!$A$51:$A$61,0),MATCH(ET.county!N$1,ET.region!$A$51:$M$51,0))","v":1.3547244094488189}]
["Beaufort ","Aurora",{"$f":"INDEX(ET.region!$A$51:$M$61,MATCH(ET.county!$B8,ET.region!$A$51:$A$61,0),MATCH(ET.county!C$1,ET.region!$A$51:$M$51,0))","v":1.581},{"$f":"INDEX(ET.region!$A$51:$M$61,MATCH(ET.county!$B8,ET.region!$A$51:$A$61,0),MATCH(ET.county!D$1,ET.region!$A$51:$M$51,0))","v":1.9600000000000002},{"$f":"INDEX(ET.region!$A$51:$M$61,MATCH(ET.county!$B8,ET.region!$A$51:$A$61,0),MATCH(ET.county!E$1,ET.region!$A$51:$M$51,0))","v":3.2549999999999999},{"$f":"INDEX(ET.region!$A$51:$M$61,MATCH(ET.county!$B8,ET.region!$A$51:$A$61,0),MATCH(ET.county!F$1,ET.region!$A$51:$M$51,0))","v":4.59},{"$f":"INDEX(ET.region!$A$51:$M$61,MATCH(ET.county!$B8,ET.region!$A$51:$A$61,0),MATCH(ET.county!G$1,ET.region!$A$51:$M$51,0))","v":5.7969999999999997},{"$f":"INDEX(ET.region!$A$51:$M$61,MATCH(ET.county!$B8,ET.region!$A$51:$A$61,0),MATCH(ET.county!H$1,ET.region!$A$51:$M$51,0))","v":6.2399999999999993},{"$f":"INDEX(ET.region!$A$51:$M$61,MATCH(ET.county!$B8,ET.region!$A$51:$A$61,0),MATCH(ET.county!I$1,ET.region!$A$51:$M$51,0))","v":6.4790000000000001},{"$f":"INDEX(ET.region!$A$51:$M$61,MATCH(ET.county!$B8,ET.region!$A$51:$A$61,0),MATCH(ET.county!J$1,ET.region!$A$51:$M$51,0))","v":5.7350000000000003},{"$f":"INDEX(ET.region!$A$51:$M$61,MATCH(ET.county!$B8,ET.region!$A$51:$A$61,0),MATCH(ET.county!K$1,ET.region!$A$51:$M$51,0))","v":4.38},{"$f":"INDEX(ET.region!$A$51:$M$61,MATCH(ET.county!$B8,ET.region!$A$51:$A$61,0),MATCH(ET.county!L$1,ET.region!$A$51:$M$51,0))","v":3.2549999999999999},{"$f":"INDEX(ET.region!$A$51:$M$61,MATCH(ET.county!$B8,ET.region!$A$51:$A$61,0),MATCH(ET.county!M$1,ET.region!$A$51:$M$51,0))","v":2.0700000000000003},{"$f":"INDEX(ET.region!$A$51:$M$61,MATCH(ET.county!$B8,ET.region!$A$51:$A$61,0),MATCH(ET.county!N$1,ET.region!$A$51:$M$51,0))","v":1.55}]
["Bertie ","Lewiston",{"$f":"INDEX(ET.region!$A$51:$M$61,MATCH(ET.county!$B9,ET.region!$A$51:$A$61,0),MATCH(ET.county!C$1,ET.region!$A$51:$M$51,0))","v":1.5255905511811025},{"$f":"INDEX(ET.region!$A$51:$M$61,MATCH(ET.county!$B9,ET.region!$A$51:$A$61,0),MATCH(ET.county!D$1,ET.region!$A$51:$M$51,0))","v":2.0173228346456695},{"$f":"INDEX(ET.region!$A$51:$M$61,MATCH(ET.county!$B9,ET.region!$A$51:$A$61,0),MATCH(ET.county!E$1,ET.region!$A$51:$M$51,0))","v":3.4905511811023624},{"$f":"INDEX(ET.region!$A$51:$M$61,MATCH(ET.county!$B9,ET.region!$A$51:$A$61,0),MATCH(ET.county!F$1,ET.region!$A$51:$M$51,0))","v":5.0551181102362204},{"$f":"INDEX(ET.region!$A$51:$M$61,MATCH(ET.county!$B9,ET.region!$A$51:$A$61,0),MATCH(ET.county!G$1,ET.region!$A$51:$M$51,0))","v":6.4318897637795267},{"$f":"INDEX(ET.region!$A$51:$M$61,MATCH(ET.county!$B9,ET.region!$A$51:$A$61,0),MATCH(ET.county!H$1,ET.region!$A$51:$M$51,0))","v":7.0748031496063},{"$f":"INDEX(ET.region!$A$51:$M$61,MATCH(ET.county!$B9,ET.region!$A$51:$A$61,0),MATCH(ET.county!I$1,ET.region!$A$51:$M$51,0))","v":7.359448818897639},{"$f":"INDEX(ET.region!$A$51:$M$61,MATCH(ET.county!$B9,ET.region!$A$51:$A$61,0),MATCH(ET.county!J$1,ET.region!$A$51:$M$51,0))","v":6.566141732283465},{"$f":"INDEX(ET.region!$A$51:$M$61,MATCH(ET.county!$B9,ET.region!$A$51:$A$61,0),MATCH(ET.county!K$1,ET.region!$A$51:$M$51,0))","v":4.9488188976377963},{"$f":"INDEX(ET.region!$A$51:$M$61,MATCH(ET.county!$B9,ET.region!$A$51:$A$61,0),MATCH(ET.county!L$1,ET.region!$A$51:$M$51,0))","v":3.5759842519685043},{"$f":"INDEX(ET.region!$A$51:$M$61,MATCH(ET.county!$B9,ET.region!$A$51:$A$61,0),MATCH(ET.county!M$1,ET.region!$A$51:$M$51,0))","v":2.1968503937007875},{"$f":"INDEX(ET.region!$A$51:$M$61,MATCH(ET.county!$B9,ET.region!$A$51:$A$61,0),MATCH(ET.county!N$1,ET.region!$A$51:$M$51,0))","v":1.5255905511811025}]
["Bladen ","Whiteville",{"$f":"INDEX(ET.region!$A$51:$M$61,MATCH(ET.county!$B10,ET.region!$A$51:$A$61,0),MATCH(ET.county!C$1,ET.region!$A$51:$M$51,0))","v":1.6964566929133857},{"$f":"INDEX(ET.region!$A$51:$M$61,MATCH(ET.county!$B10,ET.region!$A$51:$A$61,0),MATCH(ET.county!D$1,ET.region!$A$51:$M$51,0))","v":2.1496062992125986},{"$f":"INDEX(ET.region!$A$51:$M$61,MATCH(ET.county!$B10,ET.region!$A$51:$A$61,0),MATCH(ET.county!E$1,ET.region!$A$51:$M$51,0))","v":3.6248031496062993},{"$f":"INDEX(ET.region!$A$51:$M$61,MATCH(ET.county!$B10,ET.region!$A$51:$A$61,0),MATCH(ET.county!F$1,ET.region!$A$51:$M$51,0))","v":4.9724409448818898},{"$f":"INDEX(ET.region!$A$51:$M$61,MATCH(ET.county!$B10,ET.region!$A$51:$A$61,0),MATCH(ET.county!G$1,ET.region!$A$51:$M$51,0))","v":6.2976377952755911},{"$f":"INDEX(ET.region!$A$51:$M$61,MATCH(ET.county!$B10,ET.region!$A$51:$A$61,0),MATCH(ET.county!H$1,ET.region!$A$51:$M$51,0))","v":6.6141732283464565},{"$f":"INDEX(ET.region!$A$51:$M$61,MATCH(ET.county!$B10,ET.region!$A$51:$A$61,0),MATCH(ET.county!I$1,ET.region!$A$51:$M$51,0))","v":6.8590551181102368},{"$f":"INDEX(ET.region!$A$51:$M$61,MATCH(ET.county!$B10,ET.region!$A$51:$A$61,0),MATCH(ET.county!J$1,ET.region!$A$51:$M$51,0))","v":6.1755905511811022},{"$f":"INDEX(ET.region!$A$51:$M$61,MATCH(ET.county!$B10,ET.region!$A$51:$A$61,0),MATCH(ET.county!K$1,ET.region!$A$51:$M$51,0))","v":4.8661417322834648},{"$f":"INDEX(ET.region!$A$51:$M$61,MATCH(ET.county!$B10,ET.region!$A$51:$A$61,0),MATCH(ET.county!L$1,ET.region!$A$51:$M$51,0))","v":3.6370078740157483},{"$f":"INDEX(ET.region!$A$51:$M$61,MATCH(ET.county!$B10,ET.region!$A$51:$A$61,0),MATCH(ET.county!M$1,ET.region!$A$51:$M$51,0))","v":2.3622047244094486},{"$f":"INDEX(ET.region!$A$51:$M$61,MATCH(ET.county!$B10,ET.region!$A$51:$A$61,0),MATCH(ET.county!N$1,ET.region!$A$51:$M$51,0))","v":1.684251968503937}]
["Brunswick","Whiteville",{"$f":"INDEX(ET.region!$A$51:$M$61,MATCH(ET.county!$B11,ET.region!$A$51:$A$61,0),MATCH(ET.county!C$1,ET.region!$A$51:$M$51,0))","v":1.6964566929133857},{"$f":"INDEX(ET.region!$A$51:$M$61,MATCH(ET.county!$B11,ET.region!$A$51:$A$61,0),MATCH(ET.county!D$1,ET.region!$A$51:$M$51,0))","v":2.1496062992125986},{"$f":"INDEX(ET.region!$A$51:$M$61,MATCH(ET.county!$B11,ET.region!$A$51:$A$61,0),MATCH(ET.county!E$1,ET.region!$A$51:$M$51,0))","v":3.6248031496062993},{"$f":"INDEX(ET.region!$A$51:$M$61,MATCH(ET.county!$B11,ET.region!$A$51:$A$61,0),MATCH(ET.county!F$1,ET.region!$A$51:$M$51,0))","v":4.9724409448818898},{"$f":"INDEX(ET.region!$A$51:$M$61,MATCH(ET.county!$B11,ET.region!$A$51:$A$61,0),MATCH(ET.county!G$1,ET.region!$A$51:$M$51,0))","v":6.2976377952755911},{"$f":"INDEX(ET.region!$A$51:$M$61,MATCH(ET.county!$B11,ET.region!$A$51:$A$61,0),MATCH(ET.county!H$1,ET.region!$A$51:$M$51,0))","v":6.6141732283464565},{"$f":"INDEX(ET.region!$A$51:$M$61,MATCH(ET.county!$B11,ET.region!$A$51:$A$61,0),MATCH(ET.county!I$1,ET.region!$A$51:$M$51,0))","v":6.8590551181102368},{"$f":"INDEX(ET.region!$A$51:$M$61,MATCH(ET.county!$B11,ET.region!$A$51:$A$61,0),MATCH(ET.county!J$1,ET.region!$A$51:$M$51,0))","v":6.1755905511811022},{"$f":"INDEX(ET.region!$A$51:$M$61,MATCH(ET.county!$B11,ET.region!$A$51:$A$61,0),MATCH(ET.county!K$1,ET.region!$A$51:$M$51,0))","v":4.8661417322834648},{"$f":"INDEX(ET.region!$A$51:$M$61,MATCH(ET.county!$B11,ET.region!$A$51:$A$61,0),MATCH(ET.county!L$1,ET.region!$A$51:$M$51,0))","v":3.6370078740157483},{"$f":"INDEX(ET.region!$A$51:$M$61,MATCH(ET.county!$B11,ET.region!$A$51:$A$61,0),MATCH(ET.county!M$1,ET.region!$A$51:$M$51,0))","v":2.3622047244094486},{"$f":"INDEX(ET.region!$A$51:$M$61,MATCH(ET.county!$B11,ET.region!$A$51:$A$61,0),MATCH(ET.county!N$1,ET.region!$A$51:$M$51,0))","v":1.684251968503937}]
["Buncombe ","Fletcher",{"$f":"INDEX(ET.region!$A$51:$M$61,MATCH(ET.county!$B12,ET.region!$A$51:$A$61,0),MATCH(ET.county!C$1,ET.region!$A$51:$M$51,0))","v":1.3913385826771654},{"$f":"INDEX(ET.region!$A$51:$M$61,MATCH(ET.county!$B12,ET.region!$A$51:$A$61,0),MATCH(ET.county!D$1,ET.region!$A$51:$M$51,0))","v":1.7748031496062995},{"$f":"INDEX(ET.region!$A$51:$M$61,MATCH(ET.county!$B12,ET.region!$A$51:$A$61,0),MATCH(ET.county!E$1,ET.region!$A$51:$M$51,0))","v":3.0633858267716536},{"$f":"INDEX(ET.region!$A$51:$M$61,MATCH(ET.county!$B12,ET.region!$A$51:$A$61,0),MATCH(ET.county!F$1,ET.region!$A$51:$M$51,0))","v":4.4173228346456694},{"$f":"INDEX(ET.region!$A$51:$M$61,MATCH(ET.county!$B12,ET.region!$A$51:$A$61,0),MATCH(ET.county!G$1,ET.region!$A$51:$M$51,0))","v":5.7362204724409454},{"$f":"INDEX(ET.region!$A$51:$M$61,MATCH(ET.county!$B12,ET.region!$A$51:$A$61,0),MATCH(ET.county!H$1,ET.region!$A$51:$M$51,0))","v":6.3070866141732287},{"$f":"INDEX(ET.region!$A$51:$M$61,MATCH(ET.county!$B12,ET.region!$A$51:$A$61,0),MATCH(ET.county!I$1,ET.region!$A$51:$M$51,0))","v":6.5417322834645679},{"$f":"INDEX(ET.region!$A$51:$M$61,MATCH(ET.county!$B12,ET.region!$A$51:$A$61,0),MATCH(ET.county!J$1,ET.region!$A$51:$M$51,0))","v":5.9314960629921272},{"$f":"INDEX(ET.region!$A$51:$M$61,MATCH(ET.county!$B12,ET.region!$A$51:$A$61,0),MATCH(ET.county!K$1,ET.region!$A$51:$M$51,0))","v":4.5118110236220472},{"$f":"INDEX(ET.region!$A$51:$M$61,MATCH(ET.county!$B12,ET.region!$A$51:$A$61,0),MATCH(ET.county!L$1,ET.region!$A$51:$M$51,0))","v":3.270866141732284},{"$f":"INDEX(ET.region!$A$51:$M$61,MATCH(ET.county!$B12,ET.region!$A$51:$A$61,0),MATCH(ET.county!M$1,ET.region!$A$51:$M$51,0))","v":1.9724409448818898},{"$f":"INDEX(ET.region!$A$51:$M$61,MATCH(ET.county!$B12,ET.region!$A$51:$A$61,0),MATCH(ET.county!N$1,ET.region!$A$51:$M$51,0))","v":1.3547244094488189}]
["Burke ","Lenoir",{"$f":"INDEX(ET.region!$A$51:$M$61,MATCH(ET.county!$B13,ET.region!$A$51:$A$61,0),MATCH(ET.county!C$1,ET.region!$A$51:$M$51,0))","v":1.4523622047244096},{"$f":"INDEX(ET.region!$A$51:$M$61,MATCH(ET.county!$B13,ET.region!$A$51:$A$61,0),MATCH(ET.county!D$1,ET.region!$A$51:$M$51,0))","v":1.8850393700787402},{"$f":"INDEX(ET.region!$A$51:$M$61,MATCH(ET.county!$B13,ET.region!$A$51:$A$61,0),MATCH(ET.county!E$1,ET.region!$A$51:$M$51,0))","v":3.1610236220472441},{"$f":"INDEX(ET.region!$A$51:$M$61,MATCH(ET.county!$B13,ET.region!$A$51:$A$61,0),MATCH(ET.county!F$1,ET.region!$A$51:$M$51,0))","v":4.346456692913387},{"$f":"INDEX(ET.region!$A$51:$M$61,MATCH(ET.county!$B13,ET.region!$A$51:$A$61,0),MATCH(ET.county!G$1,ET.region!$A$51:$M$51,0))","v":5.333464566929135},{"$f":"INDEX(ET.region!$A$51:$M$61,MATCH(ET.county!$B13,ET.region!$A$51:$A$61,0),MATCH(ET.county!H$1,ET.region!$A$51:$M$51,0))","v":5.5748031496062991},{"$f":"INDEX(ET.region!$A$51:$M$61,MATCH(ET.county!$B13,ET.region!$A$51:$A$61,0),MATCH(ET.county!I$1,ET.region!$A$51:$M$51,0))","v":5.6751968503937018},{"$f":"INDEX(ET.region!$A$51:$M$61,MATCH(ET.county!$B13,ET.region!$A$51:$A$61,0),MATCH(ET.county!J$1,ET.region!$A$51:$M$51,0))","v":5.0893700787401581},{"$f":"INDEX(ET.region!$A$51:$M$61,MATCH(ET.county!$B13,ET.region!$A$51:$A$61,0),MATCH(ET.county!K$1,ET.region!$A$51:$M$51,0))","v":4.015748031496063},{"$f":"INDEX(ET.region!$A$51:$M$61,MATCH(ET.county!$B13,ET.region!$A$51:$A$61,0),MATCH(ET.county!L$1,ET.region!$A$51:$M$51,0))","v":3.0633858267716536},{"$f":"INDEX(ET.region!$A$51:$M$61,MATCH(ET.county!$B13,ET.region!$A$51:$A$61,0),MATCH(ET.county!M$1,ET.region!$A$51:$M$51,0))","v":1.9606299212598426},{"$f":"INDEX(ET.region!$A$51:$M$61,MATCH(ET.county!$B13,ET.region!$A$51:$A$61,0),MATCH(ET.county!N$1,ET.region!$A$51:$M$51,0))","v":1.3913385826771654}]
["Cabarrus ","Salisbury",{"$f":"INDEX(ET.region!$A$51:$M$61,MATCH(ET.county!$B14,ET.region!$A$51:$A$61,0),MATCH(ET.county!C$1,ET.region!$A$51:$M$51,0))","v":1.4889763779527558},{"$f":"INDEX(ET.region!$A$51:$M$61,MATCH(ET.county!$B14,ET.region!$A$51:$A$61,0),MATCH(ET.county!D$1,ET.region!$A$51:$M$51,0))","v":1.9401574803149606},{"$f":"INDEX(ET.region!$A$51:$M$61,MATCH(ET.county!$B14,ET.region!$A$51:$A$61,0),MATCH(ET.county!E$1,ET.region!$A$51:$M$51,0))","v":3.2952755905511819},{"$f":"INDEX(ET.region!$A$51:$M$61,MATCH(ET.county!$B14,ET.region!$A$51:$A$61,0),MATCH(ET.county!F$1,ET.region!$A$51:$M$51,0))","v":4.7007874015748037},{"$f":"INDEX(ET.region!$A$51:$M$61,MATCH(ET.county!$B14,ET.region!$A$51:$A$61,0),MATCH(ET.county!G$1,ET.region!$A$51:$M$51,0))","v":6.0169291338582678},{"$f":"INDEX(ET.region!$A$51:$M$61,MATCH(ET.county!$B14,ET.region!$A$51:$A$61,0),MATCH(ET.county!H$1,ET.region!$A$51:$M$51,0))","v":6.6496062992125982},{"$f":"INDEX(ET.region!$A$51:$M$61,MATCH(ET.county!$B14,ET.region!$A$51:$A$61,0),MATCH(ET.county!I$1,ET.region!$A$51:$M$51,0))","v":6.9322834645669289},{"$f":"INDEX(ET.region!$A$51:$M$61,MATCH(ET.county!$B14,ET.region!$A$51:$A$61,0),MATCH(ET.county!J$1,ET.region!$A$51:$M$51,0))","v":6.1755905511811022},{"$f":"INDEX(ET.region!$A$51:$M$61,MATCH(ET.county!$B14,ET.region!$A$51:$A$61,0),MATCH(ET.county!K$1,ET.region!$A$51:$M$51,0))","v":4.7125984251968509},{"$f":"INDEX(ET.region!$A$51:$M$61,MATCH(ET.county!$B14,ET.region!$A$51:$A$61,0),MATCH(ET.county!L$1,ET.region!$A$51:$M$51,0))","v":3.4173228346456694},{"$f":"INDEX(ET.region!$A$51:$M$61,MATCH(ET.county!$B14,ET.region!$A$51:$A$61,0),MATCH(ET.county!M$1,ET.region!$A$51:$M$51,0))","v":2.1141732283464569},{"$f":"INDEX(ET.region!$A$51:$M$61,MATCH(ET.county!$B14,ET.region!$A$51:$A$61,0),MATCH(ET.county!N$1,ET.region!$A$51:$M$51,0))","v":1.4523622047244096}]
["Caldwell ","Lenoir",{"$f":"INDEX(ET.region!$A$51:$M$61,MATCH(ET.county!$B15,ET.region!$A$51:$A$61,0),MATCH(ET.county!C$1,ET.region!$A$51:$M$51,0))","v":1.4523622047244096},{"$f":"INDEX(ET.region!$A$51:$M$61,MATCH(ET.county!$B15,ET.region!$A$51:$A$61,0),MATCH(ET.county!D$1,ET.region!$A$51:$M$51,0))","v":1.8850393700787402},{"$f":"INDEX(ET.region!$A$51:$M$61,MATCH(ET.county!$B15,ET.region!$A$51:$A$61,0),MATCH(ET.county!E$1,ET.region!$A$51:$M$51,0))","v":3.1610236220472441},{"$f":"INDEX(ET.region!$A$51:$M$61,MATCH(ET.county!$B15,ET.region!$A$51:$A$61,0),MATCH(ET.county!F$1,ET.region!$A$51:$M$51,0))","v":4.346456692913387},{"$f":"INDEX(ET.region!$A$51:$M$61,MATCH(ET.county!$B15,ET.region!$A$51:$A$61,0),MATCH(ET.county!G$1,ET.region!$A$51:$M$51,0))","v":5.333464566929135},{"$f":"INDEX(ET.region!$A$51:$M$61,MATCH(ET.county!$B15,ET.region!$A$51:$A$61,0),MATCH(ET.county!H$1,ET.region!$A$51:$M$51,0))","v":5.5748031496062991},{"$f":"INDEX(ET.region!$A$51:$M$61,MATCH(ET.county!$B15,ET.region!$A$51:$A$61,0),MATCH(ET.county!I$1,ET.region!$A$51:$M$51,0))","v":5.6751968503937018},{"$f":"INDEX(ET.region!$A$51:$M$61,MATCH(ET.county!$B15,ET.region!$A$51:$A$61,0),MATCH(ET.county!J$1,ET.region!$A$51:$M$51,0))","v":5.0893700787401581},{"$f":"INDEX(ET.region!$A$51:$M$61,MATCH(ET.county!$B15,ET.region!$A$51:$A$61,0),MATCH(ET.county!K$1,ET.region!$A$51:$M$51,0))","v":4.015748031496063},{"$f":"INDEX(ET.region!$A$51:$M$61,MATCH(ET.county!$B15,ET.region!$A$51:$A$61,0),MATCH(ET.county!L$1,ET.region!$A$51:$M$51,0))","v":3.0633858267716536},{"$f":"INDEX(ET.region!$A$51:$M$61,MATCH(ET.county!$B15,ET.region!$A$51:$A$61,0),MATCH(ET.county!M$1,ET.region!$A$51:$M$51,0))","v":1.9606299212598426},{"$f":"INDEX(ET.region!$A$51:$M$61,MATCH(ET.county!$B15,ET.region!$A$51:$A$61,0),MATCH(ET.county!N$1,ET.region!$A$51:$M$51,0))","v":1.3913385826771654}]
["Camden","Lewiston",{"$f":"INDEX(ET.region!$A$51:$M$61,MATCH(ET.county!$B16,ET.region!$A$51:$A$61,0),MATCH(ET.county!C$1,ET.region!$A$51:$M$51,0))","v":1.5255905511811025},{"$f":"INDEX(ET.region!$A$51:$M$61,MATCH(ET.county!$B16,ET.region!$A$51:$A$61,0),MATCH(ET.county!D$1,ET.region!$A$51:$M$51,0))","v":2.0173228346456695},{"$f":"INDEX(ET.region!$A$51:$M$61,MATCH(ET.county!$B16,ET.region!$A$51:$A$61,0),MATCH(ET.county!E$1,ET.region!$A$51:$M$51,0))","v":3.4905511811023624},{"$f":"INDEX(ET.region!$A$51:$M$61,MATCH(ET.county!$B16,ET.region!$A$51:$A$61,0),MATCH(ET.county!F$1,ET.region!$A$51:$M$51,0))","v":5.0551181102362204},{"$f":"INDEX(ET.region!$A$51:$M$61,MATCH(ET.county!$B16,ET.region!$A$51:$A$61,0),MATCH(ET.county!G$1,ET.region!$A$51:$M$51,0))","v":6.4318897637795267},{"$f":"INDEX(ET.region!$A$51:$M$61,MATCH(ET.county!$B16,ET.region!$A$51:$A$61,0),MATCH(ET.county!H$1,ET.region!$A$51:$M$51,0))","v":7.0748031496063},{"$f":"INDEX(ET.region!$A$51:$M$61,MATCH(ET.county!$B16,ET.region!$A$51:$A$61,0),MATCH(ET.county!I$1,ET.region!$A$51:$M$51,0))","v":7.359448818897639},{"$f":"INDEX(ET.region!$A$51:$M$61,MATCH(ET.county!$B16,ET.region!$A$51:$A$61,0),MATCH(ET.county!J$1,ET.region!$A$51:$M$51,0))","v":6.566141732283465},{"$f":"INDEX(ET.region!$A$51:$M$61,MATCH(ET.county!$B16,ET.region!$A$51:$A$61,0),MATCH(ET.county!K$1,ET.region!$A$51:$M$51,0))","v":4.9488188976377963},{"$f":"INDEX(ET.region!$A$51:$M$61,MATCH(ET.county!$B16,ET.region!$A$51:$A$61,0),MATCH(ET.county!L$1,ET.region!$A$51:$M$51,0))","v":3.5759842519685043},{"$f":"INDEX(ET.region!$A$51:$M$61,MATCH(ET.county!$B16,ET.region!$A$51:$A$61,0),MATCH(ET.county!M$1,ET.region!$A$51:$M$51,0))","v":2.1968503937007875},{"$f":"INDEX(ET.region!$A$51:$M$61,MATCH(ET.county!$B16,ET.region!$A$51:$A$61,0),MATCH(ET.county!N$1,ET.region!$A$51:$M$51,0))","v":1.5255905511811025}]
["Carteret ","Aurora",{"$f":"INDEX(ET.region!$A$51:$M$61,MATCH(ET.county!$B17,ET.region!$A$51:$A$61,0),MATCH(ET.county!C$1,ET.region!$A$51:$M$51,0))","v":1.581},{"$f":"INDEX(ET.region!$A$51:$M$61,MATCH(ET.county!$B17,ET.region!$A$51:$A$61,0),MATCH(ET.county!D$1,ET.region!$A$51:$M$51,0))","v":1.9600000000000002},{"$f":"INDEX(ET.region!$A$51:$M$61,MATCH(ET.county!$B17,ET.region!$A$51:$A$61,0),MATCH(ET.county!E$1,ET.region!$A$51:$M$51,0))","v":3.2549999999999999},{"$f":"INDEX(ET.region!$A$51:$M$61,MATCH(ET.county!$B17,ET.region!$A$51:$A$61,0),MATCH(ET.county!F$1,ET.region!$A$51:$M$51,0))","v":4.59},{"$f":"INDEX(ET.region!$A$51:$M$61,MATCH(ET.county!$B17,ET.region!$A$51:$A$61,0),MATCH(ET.county!G$1,ET.region!$A$51:$M$51,0))","v":5.7969999999999997},{"$f":"INDEX(ET.region!$A$51:$M$61,MATCH(ET.county!$B17,ET.region!$A$51:$A$61,0),MATCH(ET.county!H$1,ET.region!$A$51:$M$51,0))","v":6.2399999999999993},{"$f":"INDEX(ET.region!$A$51:$M$61,MATCH(ET.county!$B17,ET.region!$A$51:$A$61,0),MATCH(ET.county!I$1,ET.region!$A$51:$M$51,0))","v":6.4790000000000001},{"$f":"INDEX(ET.region!$A$51:$M$61,MATCH(ET.county!$B17,ET.region!$A$51:$A$61,0),MATCH(ET.county!J$1,ET.region!$A$51:$M$51,0))","v":5.7350000000000003},{"$f":"INDEX(ET.region!$A$51:$M$61,MATCH(ET.county!$B17,ET.region!$A$51:$A$61,0),MATCH(ET.county!K$1,ET.region!$A$51:$M$51,0))","v":4.38},{"$f":"INDEX(ET.region!$A$51:$M$61,MATCH(ET.county!$B17,ET.region!$A$51:$A$61,0),MATCH(ET.county!L$1,ET.region!$A$51:$M$51,0))","v":3.2549999999999999},{"$f":"INDEX(ET.region!$A$51:$M$61,MATCH(ET.county!$B17,ET.region!$A$51:$A$61,0),MATCH(ET.county!M$1,ET.region!$A$51:$M$51,0))","v":2.0700000000000003},{"$f":"INDEX(ET.region!$A$51:$M$61,MATCH(ET.county!$B17,ET.region!$A$51:$A$61,0),MATCH(ET.county!N$1,ET.region!$A$51:$M$51,0))","v":1.55}]
["Caswell","Reidsville",{"$f":"INDEX(ET.region!$A$51:$M$61,MATCH(ET.county!$B18,ET.region!$A$51:$A$61,0),MATCH(ET.county!C$1,ET.region!$A$51:$M$51,0))","v":1.3425196850393704},{"$f":"INDEX(ET.region!$A$51:$M$61,MATCH(ET.county!$B18,ET.region!$A$51:$A$61,0),MATCH(ET.county!D$1,ET.region!$A$51:$M$51,0))","v":1.7637795275590555},{"$f":"INDEX(ET.region!$A$51:$M$61,MATCH(ET.county!$B18,ET.region!$A$51:$A$61,0),MATCH(ET.county!E$1,ET.region!$A$51:$M$51,0))","v":3.0877952755905511},{"$f":"INDEX(ET.region!$A$51:$M$61,MATCH(ET.county!$B18,ET.region!$A$51:$A$61,0),MATCH(ET.county!F$1,ET.region!$A$51:$M$51,0))","v":4.4763779527559056},{"$f":"INDEX(ET.region!$A$51:$M$61,MATCH(ET.county!$B18,ET.region!$A$51:$A$61,0),MATCH(ET.county!G$1,ET.region!$A$51:$M$51,0))","v":5.8216535433070868},{"$f":"INDEX(ET.region!$A$51:$M$61,MATCH(ET.county!$B18,ET.region!$A$51:$A$61,0),MATCH(ET.county!H$1,ET.region!$A$51:$M$51,0))","v":6.4842519685039379},{"$f":"INDEX(ET.region!$A$51:$M$61,MATCH(ET.county!$B18,ET.region!$A$51:$A$61,0),MATCH(ET.county!I$1,ET.region!$A$51:$M$51,0))","v":6.8346456692913389},{"$f":"INDEX(ET.region!$A$51:$M$61,MATCH(ET.county!$B18,ET.region!$A$51:$A$61,0),MATCH(ET.county!J$1,ET.region!$A$51:$M$51,0))","v":6.1267716535433072},{"$f":"INDEX(ET.region!$A$51:$M$61,MATCH(ET.county!$B18,ET.region!$A$51:$A$61,0),MATCH(ET.county!K$1,ET.region!$A$51:$M$51,0))","v":4.5826771653543314},{"$f":"INDEX(ET.region!$A$51:$M$61,MATCH(ET.county!$B18,ET.region!$A$51:$A$61,0),MATCH(ET.county!L$1,ET.region!$A$51:$M$51,0))","v":3.246456692913386},{"$f":"INDEX(ET.region!$A$51:$M$61,MATCH(ET.county!$B18,ET.region!$A$51:$A$61,0),MATCH(ET.county!M$1,ET.region!$A$51:$M$51,0))","v":1.9488188976377951},{"$f":"INDEX(ET.region!$A$51:$M$61,MATCH(ET.county!$B18,ET.region!$A$51:$A$61,0),MATCH(ET.county!N$1,ET.region!$A$51:$M$51,0))","v":1.3181102362204726}]
["Catawba ","Salisbury",{"$f":"INDEX(ET.region!$A$51:$M$61,MATCH(ET.county!$B19,ET.region!$A$51:$A$61,0),MATCH(ET.county!C$1,ET.region!$A$51:$M$51,0))","v":1.4889763779527558},{"$f":"INDEX(ET.region!$A$51:$M$61,MATCH(ET.county!$B19,ET.region!$A$51:$A$61,0),MATCH(ET.county!D$1,ET.region!$A$51:$M$51,0))","v":1.9401574803149606},{"$f":"INDEX(ET.region!$A$51:$M$61,MATCH(ET.county!$B19,ET.region!$A$51:$A$61,0),MATCH(ET.county!E$1,ET.region!$A$51:$M$51,0))","v":3.2952755905511819},{"$f":"INDEX(ET.region!$A$51:$M$61,MATCH(ET.county!$B19,ET.region!$A$51:$A$61,0),MATCH(ET.county!F$1,ET.region!$A$51:$M$51,0))","v":4.7007874015748037},{"$f":"INDEX(ET.region!$A$51:$M$61,MATCH(ET.county!$B19,ET.region!$A$51:$A$61,0),MATCH(ET.county!G$1,ET.region!$A$51:$M$51,0))","v":6.0169291338582678},{"$f":"INDEX(ET.region!$A$51:$M$61,MATCH(ET.county!$B19,ET.region!$A$51:$A$61,0),MATCH(ET.county!H$1,ET.region!$A$51:$M$51,0))","v":6.6496062992125982},{"$f":"INDEX(ET.region!$A$51:$M$61,MATCH(ET.county!$B19,ET.region!$A$51:$A$61,0),MATCH(ET.county!I$1,ET.region!$A$51:$M$51,0))","v":6.9322834645669289},{"$f":"INDEX(ET.region!$A$51:$M$61,MATCH(ET.county!$B19,ET.region!$A$51:$A$61,0),MATCH(ET.county!J$1,ET.region!$A$51:$M$51,0))","v":6.1755905511811022},{"$f":"INDEX(ET.region!$A$51:$M$61,MATCH(ET.county!$B19,ET.region!$A$51:$A$61,0),MATCH(ET.county!K$1,ET.region!$A$51:$M$51,0))","v":4.7125984251968509},{"$f":"INDEX(ET.region!$A$51:$M$61,MATCH(ET.county!$B19,ET.region!$A$51:$A$61,0),MATCH(ET.county!L$1,ET.region!$A$51:$M$51,0))","v":3.4173228346456694},{"$f":"INDEX(ET.region!$A$51:$M$61,MATCH(ET.county!$B19,ET.region!$A$51:$A$61,0),MATCH(ET.county!M$1,ET.region!$A$51:$M$51,0))","v":2.1141732283464569},{"$f":"INDEX(ET.region!$A$51:$M$61,MATCH(ET.county!$B19,ET.region!$A$51:$A$61,0),MATCH(ET.county!N$1,ET.region!$A$51:$M$51,0))","v":1.4523622047244096}]
["Chatham ","Raleigh",{"$f":"INDEX(ET.region!$A$51:$M$61,MATCH(ET.county!$B20,ET.region!$A$51:$A$61,0),MATCH(ET.county!C$1,ET.region!$A$51:$M$51,0))","v":1.562204724409449},{"$f":"INDEX(ET.region!$A$51:$M$61,MATCH(ET.county!$B20,ET.region!$A$51:$A$61,0),MATCH(ET.county!D$1,ET.region!$A$51:$M$51,0))","v":2.0503937007874016},{"$f":"INDEX(ET.region!$A$51:$M$61,MATCH(ET.county!$B20,ET.region!$A$51:$A$61,0),MATCH(ET.county!E$1,ET.region!$A$51:$M$51,0))","v":3.5027559055118114},{"$f":"INDEX(ET.region!$A$51:$M$61,MATCH(ET.county!$B20,ET.region!$A$51:$A$61,0),MATCH(ET.county!F$1,ET.region!$A$51:$M$51,0))","v":4.9370078740157481},{"$f":"INDEX(ET.region!$A$51:$M$61,MATCH(ET.county!$B20,ET.region!$A$51:$A$61,0),MATCH(ET.county!G$1,ET.region!$A$51:$M$51,0))","v":6.2122047244094487},{"$f":"INDEX(ET.region!$A$51:$M$61,MATCH(ET.county!$B20,ET.region!$A$51:$A$61,0),MATCH(ET.county!H$1,ET.region!$A$51:$M$51,0))","v":6.6968503937007879},{"$f":"INDEX(ET.region!$A$51:$M$61,MATCH(ET.county!$B20,ET.region!$A$51:$A$61,0),MATCH(ET.county!I$1,ET.region!$A$51:$M$51,0))","v":6.9444881889763792},{"$f":"INDEX(ET.region!$A$51:$M$61,MATCH(ET.county!$B20,ET.region!$A$51:$A$61,0),MATCH(ET.county!J$1,ET.region!$A$51:$M$51,0))","v":6.2122047244094487},{"$f":"INDEX(ET.region!$A$51:$M$61,MATCH(ET.county!$B20,ET.region!$A$51:$A$61,0),MATCH(ET.county!K$1,ET.region!$A$51:$M$51,0))","v":4.7598425196850407},{"$f":"INDEX(ET.region!$A$51:$M$61,MATCH(ET.county!$B20,ET.region!$A$51:$A$61,0),MATCH(ET.county!L$1,ET.region!$A$51:$M$51,0))","v":3.4417322834645669},{"$f":"INDEX(ET.region!$A$51:$M$61,MATCH(ET.county!$B20,ET.region!$A$51:$A$61,0),MATCH(ET.county!M$1,ET.region!$A$51:$M$51,0))","v":2.1496062992125986},{"$f":"INDEX(ET.region!$A$51:$M$61,MATCH(ET.county!$B20,ET.region!$A$51:$A$61,0),MATCH(ET.county!N$1,ET.region!$A$51:$M$51,0))","v":1.5133858267716536}]
["Cherokee ","Fletcher",{"$f":"INDEX(ET.region!$A$51:$M$61,MATCH(ET.county!$B21,ET.region!$A$51:$A$61,0),MATCH(ET.county!C$1,ET.region!$A$51:$M$51,0))","v":1.3913385826771654},{"$f":"INDEX(ET.region!$A$51:$M$61,MATCH(ET.county!$B21,ET.region!$A$51:$A$61,0),MATCH(ET.county!D$1,ET.region!$A$51:$M$51,0))","v":1.7748031496062995},{"$f":"INDEX(ET.region!$A$51:$M$61,MATCH(ET.county!$B21,ET.region!$A$51:$A$61,0),MATCH(ET.county!E$1,ET.region!$A$51:$M$51,0))","v":3.0633858267716536},{"$f":"INDEX(ET.region!$A$51:$M$61,MATCH(ET.county!$B21,ET.region!$A$51:$A$61,0),MATCH(ET.county!F$1,ET.region!$A$51:$M$51,0))","v":4.4173228346456694},{"$f":"INDEX(ET.region!$A$51:$M$61,MATCH(ET.county!$B21,ET.region!$A$51:$A$61,0),MATCH(ET.county!G$1,ET.region!$A$51:$M$51,0))","v":5.7362204724409454},{"$f":"INDEX(ET.region!$A$51:$M$61,MATCH(ET.county!$B21,ET.region!$A$51:$A$61,0),MATCH(ET.county!H$1,ET.region!$A$51:$M$51,0))","v":6.3070866141732287},{"$f":"INDEX(ET.region!$A$51:$M$61,MATCH(ET.county!$B21,ET.region!$A$51:$A$61,0),MATCH(ET.county!I$1,ET.region!$A$51:$M$51,0))","v":6.5417322834645679},{"$f":"INDEX(ET.region!$A$51:$M$61,MATCH(ET.county!$B21,ET.region!$A$51:$A$61,0),MATCH(ET.county!J$1,ET.region!$A$51:$M$51,0))","v":5.9314960629921272},{"$f":"INDEX(ET.region!$A$51:$M$61,MATCH(ET.county!$B21,ET.region!$A$51:$A$61,0),MATCH(ET.county!K$1,ET.region!$A$51:$M$51,0))","v":4.5118110236220472},{"$f":"INDEX(ET.region!$A$51:$M$61,MATCH(ET.county!$B21,ET.region!$A$51:$A$61,0),MATCH(ET.county!L$1,ET.region!$A$51:$M$51,0))","v":3.270866141732284},{"$f":"INDEX(ET.region!$A$51:$M$61,MATCH(ET.county!$B21,ET.region!$A$51:$A$61,0),MATCH(ET.county!M$1,ET.region!$A$51:$M$51,0))","v":1.9724409448818898},{"$f":"INDEX(ET.region!$A$51:$M$61,MATCH(ET.county!$B21,ET.region!$A$51:$A$61,0),MATCH(ET.county!N$1,ET.region!$A$51:$M$51,0))","v":1.3547244094488189}]
["Chowan ","Lewiston",{"$f":"INDEX(ET.region!$A$51:$M$61,MATCH(ET.county!$B22,ET.region!$A$51:$A$61,0),MATCH(ET.county!C$1,ET.region!$A$51:$M$51,0))","v":1.5255905511811025},{"$f":"INDEX(ET.region!$A$51:$M$61,MATCH(ET.county!$B22,ET.region!$A$51:$A$61,0),MATCH(ET.county!D$1,ET.region!$A$51:$M$51,0))","v":2.0173228346456695},{"$f":"INDEX(ET.region!$A$51:$M$61,MATCH(ET.county!$B22,ET.region!$A$51:$A$61,0),MATCH(ET.county!E$1,ET.region!$A$51:$M$51,0))","v":3.4905511811023624},{"$f":"INDEX(ET.region!$A$51:$M$61,MATCH(ET.county!$B22,ET.region!$A$51:$A$61,0),MATCH(ET.county!F$1,ET.region!$A$51:$M$51,0))","v":5.0551181102362204},{"$f":"INDEX(ET.region!$A$51:$M$61,MATCH(ET.county!$B22,ET.region!$A$51:$A$61,0),MATCH(ET.county!G$1,ET.region!$A$51:$M$51,0))","v":6.4318897637795267},{"$f":"INDEX(ET.region!$A$51:$M$61,MATCH(ET.county!$B22,ET.region!$A$51:$A$61,0),MATCH(ET.county!H$1,ET.region!$A$51:$M$51,0))","v":7.0748031496063},{"$f":"INDEX(ET.region!$A$51:$M$61,MATCH(ET.county!$B22,ET.region!$A$51:$A$61,0),MATCH(ET.county!I$1,ET.region!$A$51:$M$51,0))","v":7.359448818897639},{"$f":"INDEX(ET.region!$A$51:$M$61,MATCH(ET.county!$B22,ET.region!$A$51:$A$61,0),MATCH(ET.county!J$1,ET.region!$A$51:$M$51,0))","v":6.566141732283465},{"$f":"INDEX(ET.region!$A$51:$M$61,MATCH(ET.county!$B22,ET.region!$A$51:$A$61,0),MATCH(ET.county!K$1,ET.region!$A$51:$M$51,0))","v":4.9488188976377963},{"$f":"INDEX(ET.region!$A$51:$M$61,MATCH(ET.county!$B22,ET.region!$A$51:$A$61,0),MATCH(ET.county!L$1,ET.region!$A$51:$M$51,0))","v":3.5759842519685043},{"$f":"INDEX(ET.region!$A$51:$M$61,MATCH(ET.county!$B22,ET.region!$A$51:$A$61,0),MATCH(ET.county!M$1,ET.region!$A$51:$M$51,0))","v":2.1968503937007875},{"$f":"INDEX(ET.region!$A$51:$M$61,MATCH(ET.county!$B22,ET.region!$A$51:$A$61,0),MATCH(ET.county!N$1,ET.region!$A$51:$M$51,0))","v":1.5255905511811025}]
["Clay","Fletcher",{"$f":"INDEX(ET.region!$A$51:$M$61,MATCH(ET.county!$B23,ET.region!$A$51:$A$61,0),MATCH(ET.county!C$1,ET.region!$A$51:$M$51,0))","v":1.3913385826771654},{"$f":"INDEX(ET.region!$A$51:$M$61,MATCH(ET.county!$B23,ET.region!$A$51:$A$61,0),MATCH(ET.county!D$1,ET.region!$A$51:$M$51,0))","v":1.7748031496062995},{"$f":"INDEX(ET.region!$A$51:$M$61,MATCH(ET.county!$B23,ET.region!$A$51:$A$61,0),MATCH(ET.county!E$1,ET.region!$A$51:$M$51,0))","v":3.0633858267716536},{"$f":"INDEX(ET.region!$A$51:$M$61,MATCH(ET.county!$B23,ET.region!$A$51:$A$61,0),MATCH(ET.county!F$1,ET.region!$A$51:$M$51,0))","v":4.4173228346456694},{"$f":"INDEX(ET.region!$A$51:$M$61,MATCH(ET.county!$B23,ET.region!$A$51:$A$61,0),MATCH(ET.county!G$1,ET.region!$A$51:$M$51,0))","v":5.7362204724409454},{"$f":"INDEX(ET.region!$A$51:$M$61,MATCH(ET.county!$B23,ET.region!$A$51:$A$61,0),MATCH(ET.county!H$1,ET.region!$A$51:$M$51,0))","v":6.3070866141732287},{"$f":"INDEX(ET.region!$A$51:$M$61,MATCH(ET.county!$B23,ET.region!$A$51:$A$61,0),MATCH(ET.county!I$1,ET.region!$A$51:$M$51,0))","v":6.5417322834645679},{"$f":"INDEX(ET.region!$A$51:$M$61,MATCH(ET.county!$B23,ET.region!$A$51:$A$61,0),MATCH(ET.county!J$1,ET.region!$A$51:$M$51,0))","v":5.9314960629921272},{"$f":"INDEX(ET.region!$A$51:$M$61,MATCH(ET.county!$B23,ET.region!$A$51:$A$61,0),MATCH(ET.county!K$1,ET.region!$A$51:$M$51,0))","v":4.5118110236220472},{"$f":"INDEX(ET.region!$A$51:$M$61,MATCH(ET.county!$B23,ET.region!$A$51:$A$61,0),MATCH(ET.county!L$1,ET.region!$A$51:$M$51,0))","v":3.270866141732284},{"$f":"INDEX(ET.region!$A$51:$M$61,MATCH(ET.county!$B23,ET.region!$A$51:$A$61,0),MATCH(ET.county!M$1,ET.region!$A$51:$M$51,0))","v":1.9724409448818898},{"$f":"INDEX(ET.region!$A$51:$M$61,MATCH(ET.county!$B23,ET.region!$A$51:$A$61,0),MATCH(ET.county!N$1,ET.region!$A$51:$M$51,0))","v":1.3547244094488189}]
["Cleveland ","Lenoir",{"$f":"INDEX(ET.region!$A$51:$M$61,MATCH(ET.county!$B24,ET.region!$A$51:$A$61,0),MATCH(ET.county!C$1,ET.region!$A$51:$M$51,0))","v":1.4523622047244096},{"$f":"INDEX(ET.region!$A$51:$M$61,MATCH(ET.county!$B24,ET.region!$A$51:$A$61,0),MATCH(ET.county!D$1,ET.region!$A$51:$M$51,0))","v":1.8850393700787402},{"$f":"INDEX(ET.region!$A$51:$M$61,MATCH(ET.county!$B24,ET.region!$A$51:$A$61,0),MATCH(ET.county!E$1,ET.region!$A$51:$M$51,0))","v":3.1610236220472441},{"$f":"INDEX(ET.region!$A$51:$M$61,MATCH(ET.county!$B24,ET.region!$A$51:$A$61,0),MATCH(ET.county!F$1,ET.region!$A$51:$M$51,0))","v":4.346456692913387},{"$f":"INDEX(ET.region!$A$51:$M$61,MATCH(ET.county!$B24,ET.region!$A$51:$A$61,0),MATCH(ET.county!G$1,ET.region!$A$51:$M$51,0))","v":5.333464566929135},{"$f":"INDEX(ET.region!$A$51:$M$61,MATCH(ET.county!$B24,ET.region!$A$51:$A$61,0),MATCH(ET.county!H$1,ET.region!$A$51:$M$51,0))","v":5.5748031496062991},{"$f":"INDEX(ET.region!$A$51:$M$61,MATCH(ET.county!$B24,ET.region!$A$51:$A$61,0),MATCH(ET.county!I$1,ET.region!$A$51:$M$51,0))","v":5.6751968503937018},{"$f":"INDEX(ET.region!$A$51:$M$61,MATCH(ET.county!$B24,ET.region!$A$51:$A$61,0),MATCH(ET.county!J$1,ET.region!$A$51:$M$51,0))","v":5.0893700787401581},{"$f":"INDEX(ET.region!$A$51:$M$61,MATCH(ET.county!$B24,ET.region!$A$51:$A$61,0),MATCH(ET.county!K$1,ET.region!$A$51:$M$51,0))","v":4.015748031496063},{"$f":"INDEX(ET.region!$A$51:$M$61,MATCH(ET.county!$B24,ET.region!$A$51:$A$61,0),MATCH(ET.county!L$1,ET.region!$A$51:$M$51,0))","v":3.0633858267716536},{"$f":"INDEX(ET.region!$A$51:$M$61,MATCH(ET.county!$B24,ET.region!$A$51:$A$61,0),MATCH(ET.county!M$1,ET.region!$A$51:$M$51,0))","v":1.9606299212598426},{"$f":"INDEX(ET.region!$A$51:$M$61,MATCH(ET.county!$B24,ET.region!$A$51:$A$61,0),MATCH(ET.county!N$1,ET.region!$A$51:$M$51,0))","v":1.3913385826771654}]
["Columbus ","Whiteville",{"$f":"INDEX(ET.region!$A$51:$M$61,MATCH(ET.county!$B25,ET.region!$A$51:$A$61,0),MATCH(ET.county!C$1,ET.region!$A$51:$M$51,0))","v":1.6964566929133857},{"$f":"INDEX(ET.region!$A$51:$M$61,MATCH(ET.county!$B25,ET.region!$A$51:$A$61,0),MATCH(ET.county!D$1,ET.region!$A$51:$M$51,0))","v":2.1496062992125986},{"$f":"INDEX(ET.region!$A$51:$M$61,MATCH(ET.county!$B25,ET.region!$A$51:$A$61,0),MATCH(ET.county!E$1,ET.region!$A$51:$M$51,0))","v":3.6248031496062993},{"$f":"INDEX(ET.region!$A$51:$M$61,MATCH(ET.county!$B25,ET.region!$A$51:$A$61,0),MATCH(ET.county!F$1,ET.region!$A$51:$M$51,0))","v":4.9724409448818898},{"$f":"INDEX(ET.region!$A$51:$M$61,MATCH(ET.county!$B25,ET.region!$A$51:$A$61,0),MATCH(ET.county!G$1,ET.region!$A$51:$M$51,0))","v":6.2976377952755911},{"$f":"INDEX(ET.region!$A$51:$M$61,MATCH(ET.county!$B25,ET.region!$A$51:$A$61,0),MATCH(ET.county!H$1,ET.region!$A$51:$M$51,0))","v":6.6141732283464565},{"$f":"INDEX(ET.region!$A$51:$M$61,MATCH(ET.county!$B25,ET.region!$A$51:$A$61,0),MATCH(ET.county!I$1,ET.region!$A$51:$M$51,0))","v":6.8590551181102368},{"$f":"INDEX(ET.region!$A$51:$M$61,MATCH(ET.county!$B25,ET.region!$A$51:$A$61,0),MATCH(ET.county!J$1,ET.region!$A$51:$M$51,0))","v":6.1755905511811022},{"$f":"INDEX(ET.region!$A$51:$M$61,MATCH(ET.county!$B25,ET.region!$A$51:$A$61,0),MATCH(ET.county!K$1,ET.region!$A$51:$M$51,0))","v":4.8661417322834648},{"$f":"INDEX(ET.region!$A$51:$M$61,MATCH(ET.county!$B25,ET.region!$A$51:$A$61,0),MATCH(ET.county!L$1,ET.region!$A$51:$M$51,0))","v":3.6370078740157483},{"$f":"INDEX(ET.region!$A$51:$M$61,MATCH(ET.county!$B25,ET.region!$A$51:$A$61,0),MATCH(ET.county!M$1,ET.region!$A$51:$M$51,0))","v":2.3622047244094486},{"$f":"INDEX(ET.region!$A$51:$M$61,MATCH(ET.county!$B25,ET.region!$A$51:$A$61,0),MATCH(ET.county!N$1,ET.region!$A$51:$M$51,0))","v":1.684251968503937}]
["Craven","Aurora",{"$f":"INDEX(ET.region!$A$51:$M$61,MATCH(ET.county!$B26,ET.region!$A$51:$A$61,0),MATCH(ET.county!C$1,ET.region!$A$51:$M$51,0))","v":1.581},{"$f":"INDEX(ET.region!$A$51:$M$61,MATCH(ET.county!$B26,ET.region!$A$51:$A$61,0),MATCH(ET.county!D$1,ET.region!$A$51:$M$51,0))","v":1.9600000000000002},{"$f":"INDEX(ET.region!$A$51:$M$61,MATCH(ET.county!$B26,ET.region!$A$51:$A$61,0),MATCH(ET.county!E$1,ET.region!$A$51:$M$51,0))","v":3.2549999999999999},{"$f":"INDEX(ET.region!$A$51:$M$61,MATCH(ET.county!$B26,ET.region!$A$51:$A$61,0),MATCH(ET.county!F$1,ET.region!$A$51:$M$51,0))","v":4.59},{"$f":"INDEX(ET.region!$A$51:$M$61,MATCH(ET.county!$B26,ET.region!$A$51:$A$61,0),MATCH(ET.county!G$1,ET.region!$A$51:$M$51,0))","v":5.7969999999999997},{"$f":"INDEX(ET.region!$A$51:$M$61,MATCH(ET.county!$B26,ET.region!$A$51:$A$61,0),MATCH(ET.county!H$1,ET.region!$A$51:$M$51,0))","v":6.2399999999999993},{"$f":"INDEX(ET.region!$A$51:$M$61,MATCH(ET.county!$B26,ET.region!$A$51:$A$61,0),MATCH(ET.county!I$1,ET.region!$A$51:$M$51,0))","v":6.4790000000000001},{"$f":"INDEX(ET.region!$A$51:$M$61,MATCH(ET.county!$B26,ET.region!$A$51:$A$61,0),MATCH(ET.county!J$1,ET.region!$A$51:$M$51,0))","v":5.7350000000000003},{"$f":"INDEX(ET.region!$A$51:$M$61,MATCH(ET.county!$B26,ET.region!$A$51:$A$61,0),MATCH(ET.county!K$1,ET.region!$A$51:$M$51,0))","v":4.38},{"$f":"INDEX(ET.region!$A$51:$M$61,MATCH(ET.county!$B26,ET.region!$A$51:$A$61,0),MATCH(ET.county!L$1,ET.region!$A$51:$M$51,0))","v":3.2549999999999999},{"$f":"INDEX(ET.region!$A$51:$M$61,MATCH(ET.county!$B26,ET.region!$A$51:$A$61,0),MATCH(ET.county!M$1,ET.region!$A$51:$M$51,0))","v":2.0700000000000003},{"$f":"INDEX(ET.region!$A$51:$M$61,MATCH(ET.county!$B26,ET.region!$A$51:$A$61,0),MATCH(ET.county!N$1,ET.region!$A$51:$M$51,0))","v":1.55}]
["Cumberland ","Whiteville",{"$f":"INDEX(ET.region!$A$51:$M$61,MATCH(ET.county!$B27,ET.region!$A$51:$A$61,0),MATCH(ET.county!C$1,ET.region!$A$51:$M$51,0))","v":1.6964566929133857},{"$f":"INDEX(ET.region!$A$51:$M$61,MATCH(ET.county!$B27,ET.region!$A$51:$A$61,0),MATCH(ET.county!D$1,ET.region!$A$51:$M$51,0))","v":2.1496062992125986},{"$f":"INDEX(ET.region!$A$51:$M$61,MATCH(ET.county!$B27,ET.region!$A$51:$A$61,0),MATCH(ET.county!E$1,ET.region!$A$51:$M$51,0))","v":3.6248031496062993},{"$f":"INDEX(ET.region!$A$51:$M$61,MATCH(ET.county!$B27,ET.region!$A$51:$A$61,0),MATCH(ET.county!F$1,ET.region!$A$51:$M$51,0))","v":4.9724409448818898},{"$f":"INDEX(ET.region!$A$51:$M$61,MATCH(ET.county!$B27,ET.region!$A$51:$A$61,0),MATCH(ET.county!G$1,ET.region!$A$51:$M$51,0))","v":6.2976377952755911},{"$f":"INDEX(ET.region!$A$51:$M$61,MATCH(ET.county!$B27,ET.region!$A$51:$A$61,0),MATCH(ET.county!H$1,ET.region!$A$51:$M$51,0))","v":6.6141732283464565},{"$f":"INDEX(ET.region!$A$51:$M$61,MATCH(ET.county!$B27,ET.region!$A$51:$A$61,0),MATCH(ET.county!I$1,ET.region!$A$51:$M$51,0))","v":6.8590551181102368},{"$f":"INDEX(ET.region!$A$51:$M$61,MATCH(ET.county!$B27,ET.region!$A$51:$A$61,0),MATCH(ET.county!J$1,ET.region!$A$51:$M$51,0))","v":6.1755905511811022},{"$f":"INDEX(ET.region!$A$51:$M$61,MATCH(ET.county!$B27,ET.region!$A$51:$A$61,0),MATCH(ET.county!K$1,ET.region!$A$51:$M$51,0))","v":4.8661417322834648},{"$f":"INDEX(ET.region!$A$51:$M$61,MATCH(ET.county!$B27,ET.region!$A$51:$A$61,0),MATCH(ET.county!L$1,ET.region!$A$51:$M$51,0))","v":3.6370078740157483},{"$f":"INDEX(ET.region!$A$51:$M$61,MATCH(ET.county!$B27,ET.region!$A$51:$A$61,0),MATCH(ET.county!M$1,ET.region!$A$51:$M$51,0))","v":2.3622047244094486},{"$f":"INDEX(ET.region!$A$51:$M$61,MATCH(ET.county!$B27,ET.region!$A$51:$A$61,0),MATCH(ET.county!N$1,ET.region!$A$51:$M$51,0))","v":1.684251968503937}]
["Currituck","Lewiston",{"$f":"INDEX(ET.region!$A$51:$M$61,MATCH(ET.county!$B28,ET.region!$A$51:$A$61,0),MATCH(ET.county!C$1,ET.region!$A$51:$M$51,0))","v":1.5255905511811025},{"$f":"INDEX(ET.region!$A$51:$M$61,MATCH(ET.county!$B28,ET.region!$A$51:$A$61,0),MATCH(ET.county!D$1,ET.region!$A$51:$M$51,0))","v":2.0173228346456695},{"$f":"INDEX(ET.region!$A$51:$M$61,MATCH(ET.county!$B28,ET.region!$A$51:$A$61,0),MATCH(ET.county!E$1,ET.region!$A$51:$M$51,0))","v":3.4905511811023624},{"$f":"INDEX(ET.region!$A$51:$M$61,MATCH(ET.county!$B28,ET.region!$A$51:$A$61,0),MATCH(ET.county!F$1,ET.region!$A$51:$M$51,0))","v":5.0551181102362204},{"$f":"INDEX(ET.region!$A$51:$M$61,MATCH(ET.county!$B28,ET.region!$A$51:$A$61,0),MATCH(ET.county!G$1,ET.region!$A$51:$M$51,0))","v":6.4318897637795267},{"$f":"INDEX(ET.region!$A$51:$M$61,MATCH(ET.county!$B28,ET.region!$A$51:$A$61,0),MATCH(ET.county!H$1,ET.region!$A$51:$M$51,0))","v":7.0748031496063},{"$f":"INDEX(ET.region!$A$51:$M$61,MATCH(ET.county!$B28,ET.region!$A$51:$A$61,0),MATCH(ET.county!I$1,ET.region!$A$51:$M$51,0))","v":7.359448818897639},{"$f":"INDEX(ET.region!$A$51:$M$61,MATCH(ET.county!$B28,ET.region!$A$51:$A$61,0),MATCH(ET.county!J$1,ET.region!$A$51:$M$51,0))","v":6.566141732283465},{"$f":"INDEX(ET.region!$A$51:$M$61,MATCH(ET.county!$B28,ET.region!$A$51:$A$61,0),MATCH(ET.county!K$1,ET.region!$A$51:$M$51,0))","v":4.9488188976377963},{"$f":"INDEX(ET.region!$A$51:$M$61,MATCH(ET.county!$B28,ET.region!$A$51:$A$61,0),MATCH(ET.county!L$1,ET.region!$A$51:$M$51,0))","v":3.5759842519685043},{"$f":"INDEX(ET.region!$A$51:$M$61,MATCH(ET.county!$B28,ET.region!$A$51:$A$61,0),MATCH(ET.county!M$1,ET.region!$A$51:$M$51,0))","v":2.1968503937007875},{"$f":"INDEX(ET.region!$A$51:$M$61,MATCH(ET.county!$B28,ET.region!$A$51:$A$61,0),MATCH(ET.county!N$1,ET.region!$A$51:$M$51,0))","v":1.5255905511811025}]
["Dare","Aurora",{"$f":"INDEX(ET.region!$A$51:$M$61,MATCH(ET.county!$B29,ET.region!$A$51:$A$61,0),MATCH(ET.county!C$1,ET.region!$A$51:$M$51,0))","v":1.581},{"$f":"INDEX(ET.region!$A$51:$M$61,MATCH(ET.county!$B29,ET.region!$A$51:$A$61,0),MATCH(ET.county!D$1,ET.region!$A$51:$M$51,0))","v":1.9600000000000002},{"$f":"INDEX(ET.region!$A$51:$M$61,MATCH(ET.county!$B29,ET.region!$A$51:$A$61,0),MATCH(ET.county!E$1,ET.region!$A$51:$M$51,0))","v":3.2549999999999999},{"$f":"INDEX(ET.region!$A$51:$M$61,MATCH(ET.county!$B29,ET.region!$A$51:$A$61,0),MATCH(ET.county!F$1,ET.region!$A$51:$M$51,0))","v":4.59},{"$f":"INDEX(ET.region!$A$51:$M$61,MATCH(ET.county!$B29,ET.region!$A$51:$A$61,0),MATCH(ET.county!G$1,ET.region!$A$51:$M$51,0))","v":5.7969999999999997},{"$f":"INDEX(ET.region!$A$51:$M$61,MATCH(ET.county!$B29,ET.region!$A$51:$A$61,0),MATCH(ET.county!H$1,ET.region!$A$51:$M$51,0))","v":6.2399999999999993},{"$f":"INDEX(ET.region!$A$51:$M$61,MATCH(ET.county!$B29,ET.region!$A$51:$A$61,0),MATCH(ET.county!I$1,ET.region!$A$51:$M$51,0))","v":6.4790000000000001},{"$f":"INDEX(ET.region!$A$51:$M$61,MATCH(ET.county!$B29,ET.region!$A$51:$A$61,0),MATCH(ET.county!J$1,ET.region!$A$51:$M$51,0))","v":5.7350000000000003},{"$f":"INDEX(ET.region!$A$51:$M$61,MATCH(ET.county!$B29,ET.region!$A$51:$A$61,0),MATCH(ET.county!K$1,ET.region!$A$51:$M$51,0))","v":4.38},{"$f":"INDEX(ET.region!$A$51:$M$61,MATCH(ET.county!$B29,ET.region!$A$51:$A$61,0),MATCH(ET.county!L$1,ET.region!$A$51:$M$51,0))","v":3.2549999999999999},{"$f":"INDEX(ET.region!$A$51:$M$61,MATCH(ET.county!$B29,ET.region!$A$51:$A$61,0),MATCH(ET.county!M$1,ET.region!$A$51:$M$51,0))","v":2.0700000000000003},{"$f":"INDEX(ET.region!$A$51:$M$61,MATCH(ET.county!$B29,ET.region!$A$51:$A$61,0),MATCH(ET.county!N$1,ET.region!$A$51:$M$51,0))","v":1.55}]
["Davidson ","Salisbury",{"$f":"INDEX(ET.region!$A$51:$M$61,MATCH(ET.county!$B30,ET.region!$A$51:$A$61,0),MATCH(ET.county!C$1,ET.region!$A$51:$M$51,0))","v":1.4889763779527558},{"$f":"INDEX(ET.region!$A$51:$M$61,MATCH(ET.county!$B30,ET.region!$A$51:$A$61,0),MATCH(ET.county!D$1,ET.region!$A$51:$M$51,0))","v":1.9401574803149606},{"$f":"INDEX(ET.region!$A$51:$M$61,MATCH(ET.county!$B30,ET.region!$A$51:$A$61,0),MATCH(ET.county!E$1,ET.region!$A$51:$M$51,0))","v":3.2952755905511819},{"$f":"INDEX(ET.region!$A$51:$M$61,MATCH(ET.county!$B30,ET.region!$A$51:$A$61,0),MATCH(ET.county!F$1,ET.region!$A$51:$M$51,0))","v":4.7007874015748037},{"$f":"INDEX(ET.region!$A$51:$M$61,MATCH(ET.county!$B30,ET.region!$A$51:$A$61,0),MATCH(ET.county!G$1,ET.region!$A$51:$M$51,0))","v":6.0169291338582678},{"$f":"INDEX(ET.region!$A$51:$M$61,MATCH(ET.county!$B30,ET.region!$A$51:$A$61,0),MATCH(ET.county!H$1,ET.region!$A$51:$M$51,0))","v":6.6496062992125982},{"$f":"INDEX(ET.region!$A$51:$M$61,MATCH(ET.county!$B30,ET.region!$A$51:$A$61,0),MATCH(ET.county!I$1,ET.region!$A$51:$M$51,0))","v":6.9322834645669289},{"$f":"INDEX(ET.region!$A$51:$M$61,MATCH(ET.county!$B30,ET.region!$A$51:$A$61,0),MATCH(ET.county!J$1,ET.region!$A$51:$M$51,0))","v":6.1755905511811022},{"$f":"INDEX(ET.region!$A$51:$M$61,MATCH(ET.county!$B30,ET.region!$A$51:$A$61,0),MATCH(ET.county!K$1,ET.region!$A$51:$M$51,0))","v":4.7125984251968509},{"$f":"INDEX(ET.region!$A$51:$M$61,MATCH(ET.county!$B30,ET.region!$A$51:$A$61,0),MATCH(ET.county!L$1,ET.region!$A$51:$M$51,0))","v":3.4173228346456694},{"$f":"INDEX(ET.region!$A$51:$M$61,MATCH(ET.county!$B30,ET.region!$A$51:$A$61,0),MATCH(ET.county!M$1,ET.region!$A$51:$M$51,0))","v":2.1141732283464569},{"$f":"INDEX(ET.region!$A$51:$M$61,MATCH(ET.county!$B30,ET.region!$A$51:$A$61,0),MATCH(ET.county!N$1,ET.region!$A$51:$M$51,0))","v":1.4523622047244096}]
["Davie ","Salisbury",{"$f":"INDEX(ET.region!$A$51:$M$61,MATCH(ET.county!$B31,ET.region!$A$51:$A$61,0),MATCH(ET.county!C$1,ET.region!$A$51:$M$51,0))","v":1.4889763779527558},{"$f":"INDEX(ET.region!$A$51:$M$61,MATCH(ET.county!$B31,ET.region!$A$51:$A$61,0),MATCH(ET.county!D$1,ET.region!$A$51:$M$51,0))","v":1.9401574803149606},{"$f":"INDEX(ET.region!$A$51:$M$61,MATCH(ET.county!$B31,ET.region!$A$51:$A$61,0),MATCH(ET.county!E$1,ET.region!$A$51:$M$51,0))","v":3.2952755905511819},{"$f":"INDEX(ET.region!$A$51:$M$61,MATCH(ET.county!$B31,ET.region!$A$51:$A$61,0),MATCH(ET.county!F$1,ET.region!$A$51:$M$51,0))","v":4.7007874015748037},{"$f":"INDEX(ET.region!$A$51:$M$61,MATCH(ET.county!$B31,ET.region!$A$51:$A$61,0),MATCH(ET.county!G$1,ET.region!$A$51:$M$51,0))","v":6.0169291338582678},{"$f":"INDEX(ET.region!$A$51:$M$61,MATCH(ET.county!$B31,ET.region!$A$51:$A$61,0),MATCH(ET.county!H$1,ET.region!$A$51:$M$51,0))","v":6.6496062992125982},{"$f":"INDEX(ET.region!$A$51:$M$61,MATCH(ET.county!$B31,ET.region!$A$51:$A$61,0),MATCH(ET.county!I$1,ET.region!$A$51:$M$51,0))","v":6.9322834645669289},{"$f":"INDEX(ET.region!$A$51:$M$61,MATCH(ET.county!$B31,ET.region!$A$51:$A$61,0),MATCH(ET.county!J$1,ET.region!$A$51:$M$51,0))","v":6.1755905511811022},{"$f":"INDEX(ET.region!$A$51:$M$61,MATCH(ET.county!$B31,ET.region!$A$51:$A$61,0),MATCH(ET.county!K$1,ET.region!$A$51:$M$51,0))","v":4.7125984251968509},{"$f":"INDEX(ET.region!$A$51:$M$61,MATCH(ET.county!$B31,ET.region!$A$51:$A$61,0),MATCH(ET.county!L$1,ET.region!$A$51:$M$51,0))","v":3.4173228346456694},{"$f":"INDEX(ET.region!$A$51:$M$61,MATCH(ET.county!$B31,ET.region!$A$51:$A$61,0),MATCH(ET.county!M$1,ET.region!$A$51:$M$51,0))","v":2.1141732283464569},{"$f":"INDEX(ET.region!$A$51:$M$61,MATCH(ET.county!$B31,ET.region!$A$51:$A$61,0),MATCH(ET.county!N$1,ET.region!$A$51:$M$51,0))","v":1.4523622047244096}]
["Duplin","Goldsboro",{"$f":"INDEX(ET.region!$A$51:$M$61,MATCH(ET.county!$B32,ET.region!$A$51:$A$61,0),MATCH(ET.county!C$1,ET.region!$A$51:$M$51,0))","v":1.5744094488188978},{"$f":"INDEX(ET.region!$A$51:$M$61,MATCH(ET.county!$B32,ET.region!$A$51:$A$61,0),MATCH(ET.county!D$1,ET.region!$A$51:$M$51,0))","v":2.0173228346456695},{"$f":"INDEX(ET.region!$A$51:$M$61,MATCH(ET.county!$B32,ET.region!$A$51:$A$61,0),MATCH(ET.county!E$1,ET.region!$A$51:$M$51,0))","v":3.4661417322834644},{"$f":"INDEX(ET.region!$A$51:$M$61,MATCH(ET.county!$B32,ET.region!$A$51:$A$61,0),MATCH(ET.county!F$1,ET.region!$A$51:$M$51,0))","v":4.877952755905512},{"$f":"INDEX(ET.region!$A$51:$M$61,MATCH(ET.county!$B32,ET.region!$A$51:$A$61,0),MATCH(ET.county!G$1,ET.region!$A$51:$M$51,0))","v":6.2976377952755911},{"$f":"INDEX(ET.region!$A$51:$M$61,MATCH(ET.county!$B32,ET.region!$A$51:$A$61,0),MATCH(ET.county!H$1,ET.region!$A$51:$M$51,0))","v":6.6968503937007879},{"$f":"INDEX(ET.region!$A$51:$M$61,MATCH(ET.county!$B32,ET.region!$A$51:$A$61,0),MATCH(ET.county!I$1,ET.region!$A$51:$M$51,0))","v":6.8346456692913389},{"$f":"INDEX(ET.region!$A$51:$M$61,MATCH(ET.county!$B32,ET.region!$A$51:$A$61,0),MATCH(ET.county!J$1,ET.region!$A$51:$M$51,0))","v":6.1145669291338578},{"$f":"INDEX(ET.region!$A$51:$M$61,MATCH(ET.county!$B32,ET.region!$A$51:$A$61,0),MATCH(ET.county!K$1,ET.region!$A$51:$M$51,0))","v":4.7125984251968509},{"$f":"INDEX(ET.region!$A$51:$M$61,MATCH(ET.county!$B32,ET.region!$A$51:$A$61,0),MATCH(ET.county!L$1,ET.region!$A$51:$M$51,0))","v":3.4661417322834644},{"$f":"INDEX(ET.region!$A$51:$M$61,MATCH(ET.county!$B32,ET.region!$A$51:$A$61,0),MATCH(ET.county!M$1,ET.region!$A$51:$M$51,0))","v":2.1968503937007875},{"$f":"INDEX(ET.region!$A$51:$M$61,MATCH(ET.county!$B32,ET.region!$A$51:$A$61,0),MATCH(ET.county!N$1,ET.region!$A$51:$M$51,0))","v":1.55}]
["Durham ","Raleigh",{"$f":"INDEX(ET.region!$A$51:$M$61,MATCH(ET.county!$B33,ET.region!$A$51:$A$61,0),MATCH(ET.county!C$1,ET.region!$A$51:$M$51,0))","v":1.562204724409449},{"$f":"INDEX(ET.region!$A$51:$M$61,MATCH(ET.county!$B33,ET.region!$A$51:$A$61,0),MATCH(ET.county!D$1,ET.region!$A$51:$M$51,0))","v":2.0503937007874016},{"$f":"INDEX(ET.region!$A$51:$M$61,MATCH(ET.county!$B33,ET.region!$A$51:$A$61,0),MATCH(ET.county!E$1,ET.region!$A$51:$M$51,0))","v":3.5027559055118114},{"$f":"INDEX(ET.region!$A$51:$M$61,MATCH(ET.county!$B33,ET.region!$A$51:$A$61,0),MATCH(ET.county!F$1,ET.region!$A$51:$M$51,0))","v":4.9370078740157481},{"$f":"INDEX(ET.region!$A$51:$M$61,MATCH(ET.county!$B33,ET.region!$A$51:$A$61,0),MATCH(ET.county!G$1,ET.region!$A$51:$M$51,0))","v":6.2122047244094487},{"$f":"INDEX(ET.region!$A$51:$M$61,MATCH(ET.county!$B33,ET.region!$A$51:$A$61,0),MATCH(ET.county!H$1,ET.region!$A$51:$M$51,0))","v":6.6968503937007879},{"$f":"INDEX(ET.region!$A$51:$M$61,MATCH(ET.county!$B33,ET.region!$A$51:$A$61,0),MATCH(ET.county!I$1,ET.region!$A$51:$M$51,0))","v":6.9444881889763792},{"$f":"INDEX(ET.region!$A$51:$M$61,MATCH(ET.county!$B33,ET.region!$A$51:$A$61,0),MATCH(ET.county!J$1,ET.region!$A$51:$M$51,0))","v":6.2122047244094487},{"$f":"INDEX(ET.region!$A$51:$M$61,MATCH(ET.county!$B33,ET.region!$A$51:$A$61,0),MATCH(ET.county!K$1,ET.region!$A$51:$M$51,0))","v":4.7598425196850407},{"$f":"INDEX(ET.region!$A$51:$M$61,MATCH(ET.county!$B33,ET.region!$A$51:$A$61,0),MATCH(ET.county!L$1,ET.region!$A$51:$M$51,0))","v":3.4417322834645669},{"$f":"INDEX(ET.region!$A$51:$M$61,MATCH(ET.county!$B33,ET.region!$A$51:$A$61,0),MATCH(ET.county!M$1,ET.region!$A$51:$M$51,0))","v":2.1496062992125986},{"$f":"INDEX(ET.region!$A$51:$M$61,MATCH(ET.county!$B33,ET.region!$A$51:$A$61,0),MATCH(ET.county!N$1,ET.region!$A$51:$M$51,0))","v":1.5133858267716536}]
["Edgecombe ","Lewiston",{"$f":"INDEX(ET.region!$A$51:$M$61,MATCH(ET.county!$B34,ET.region!$A$51:$A$61,0),MATCH(ET.county!C$1,ET.region!$A$51:$M$51,0))","v":1.5255905511811025},{"$f":"INDEX(ET.region!$A$51:$M$61,MATCH(ET.county!$B34,ET.region!$A$51:$A$61,0),MATCH(ET.county!D$1,ET.region!$A$51:$M$51,0))","v":2.0173228346456695},{"$f":"INDEX(ET.region!$A$51:$M$61,MATCH(ET.county!$B34,ET.region!$A$51:$A$61,0),MATCH(ET.county!E$1,ET.region!$A$51:$M$51,0))","v":3.4905511811023624},{"$f":"INDEX(ET.region!$A$51:$M$61,MATCH(ET.county!$B34,ET.region!$A$51:$A$61,0),MATCH(ET.county!F$1,ET.region!$A$51:$M$51,0))","v":5.0551181102362204},{"$f":"INDEX(ET.region!$A$51:$M$61,MATCH(ET.county!$B34,ET.region!$A$51:$A$61,0),MATCH(ET.county!G$1,ET.region!$A$51:$M$51,0))","v":6.4318897637795267},{"$f":"INDEX(ET.region!$A$51:$M$61,MATCH(ET.county!$B34,ET.region!$A$51:$A$61,0),MATCH(ET.county!H$1,ET.region!$A$51:$M$51,0))","v":7.0748031496063},{"$f":"INDEX(ET.region!$A$51:$M$61,MATCH(ET.county!$B34,ET.region!$A$51:$A$61,0),MATCH(ET.county!I$1,ET.region!$A$51:$M$51,0))","v":7.359448818897639},{"$f":"INDEX(ET.region!$A$51:$M$61,MATCH(ET.county!$B34,ET.region!$A$51:$A$61,0),MATCH(ET.county!J$1,ET.region!$A$51:$M$51,0))","v":6.566141732283465},{"$f":"INDEX(ET.region!$A$51:$M$61,MATCH(ET.county!$B34,ET.region!$A$51:$A$61,0),MATCH(ET.county!K$1,ET.region!$A$51:$M$51,0))","v":4.9488188976377963},{"$f":"INDEX(ET.region!$A$51:$M$61,MATCH(ET.county!$B34,ET.region!$A$51:$A$61,0),MATCH(ET.county!L$1,ET.region!$A$51:$M$51,0))","v":3.5759842519685043},{"$f":"INDEX(ET.region!$A$51:$M$61,MATCH(ET.county!$B34,ET.region!$A$51:$A$61,0),MATCH(ET.county!M$1,ET.region!$A$51:$M$51,0))","v":2.1968503937007875},{"$f":"INDEX(ET.region!$A$51:$M$61,MATCH(ET.county!$B34,ET.region!$A$51:$A$61,0),MATCH(ET.county!N$1,ET.region!$A$51:$M$51,0))","v":1.5255905511811025}]
["Forsyth","Reidsville",{"$f":"INDEX(ET.region!$A$51:$M$61,MATCH(ET.county!$B35,ET.region!$A$51:$A$61,0),MATCH(ET.county!C$1,ET.region!$A$51:$M$51,0))","v":1.3425196850393704},{"$f":"INDEX(ET.region!$A$51:$M$61,MATCH(ET.county!$B35,ET.region!$A$51:$A$61,0),MATCH(ET.county!D$1,ET.region!$A$51:$M$51,0))","v":1.7637795275590555},{"$f":"INDEX(ET.region!$A$51:$M$61,MATCH(ET.county!$B35,ET.region!$A$51:$A$61,0),MATCH(ET.county!E$1,ET.region!$A$51:$M$51,0))","v":3.0877952755905511},{"$f":"INDEX(ET.region!$A$51:$M$61,MATCH(ET.county!$B35,ET.region!$A$51:$A$61,0),MATCH(ET.county!F$1,ET.region!$A$51:$M$51,0))","v":4.4763779527559056},{"$f":"INDEX(ET.region!$A$51:$M$61,MATCH(ET.county!$B35,ET.region!$A$51:$A$61,0),MATCH(ET.county!G$1,ET.region!$A$51:$M$51,0))","v":5.8216535433070868},{"$f":"INDEX(ET.region!$A$51:$M$61,MATCH(ET.county!$B35,ET.region!$A$51:$A$61,0),MATCH(ET.county!H$1,ET.region!$A$51:$M$51,0))","v":6.4842519685039379},{"$f":"INDEX(ET.region!$A$51:$M$61,MATCH(ET.county!$B35,ET.region!$A$51:$A$61,0),MATCH(ET.county!I$1,ET.region!$A$51:$M$51,0))","v":6.8346456692913389},{"$f":"INDEX(ET.region!$A$51:$M$61,MATCH(ET.county!$B35,ET.region!$A$51:$A$61,0),MATCH(ET.county!J$1,ET.region!$A$51:$M$51,0))","v":6.1267716535433072},{"$f":"INDEX(ET.region!$A$51:$M$61,MATCH(ET.county!$B35,ET.region!$A$51:$A$61,0),MATCH(ET.county!K$1,ET.region!$A$51:$M$51,0))","v":4.5826771653543314},{"$f":"INDEX(ET.region!$A$51:$M$61,MATCH(ET.county!$B35,ET.region!$A$51:$A$61,0),MATCH(ET.county!L$1,ET.region!$A$51:$M$51,0))","v":3.246456692913386},{"$f":"INDEX(ET.region!$A$51:$M$61,MATCH(ET.county!$B35,ET.region!$A$51:$A$61,0),MATCH(ET.county!M$1,ET.region!$A$51:$M$51,0))","v":1.9488188976377951},{"$f":"INDEX(ET.region!$A$51:$M$61,MATCH(ET.county!$B35,ET.region!$A$51:$A$61,0),MATCH(ET.county!N$1,ET.region!$A$51:$M$51,0))","v":1.3181102362204726}]
["Franklin ","Raleigh",{"$f":"INDEX(ET.region!$A$51:$M$61,MATCH(ET.county!$B36,ET.region!$A$51:$A$61,0),MATCH(ET.county!C$1,ET.region!$A$51:$M$51,0))","v":1.562204724409449},{"$f":"INDEX(ET.region!$A$51:$M$61,MATCH(ET.county!$B36,ET.region!$A$51:$A$61,0),MATCH(ET.county!D$1,ET.region!$A$51:$M$51,0))","v":2.0503937007874016},{"$f":"INDEX(ET.region!$A$51:$M$61,MATCH(ET.county!$B36,ET.region!$A$51:$A$61,0),MATCH(ET.county!E$1,ET.region!$A$51:$M$51,0))","v":3.5027559055118114},{"$f":"INDEX(ET.region!$A$51:$M$61,MATCH(ET.county!$B36,ET.region!$A$51:$A$61,0),MATCH(ET.county!F$1,ET.region!$A$51:$M$51,0))","v":4.9370078740157481},{"$f":"INDEX(ET.region!$A$51:$M$61,MATCH(ET.county!$B36,ET.region!$A$51:$A$61,0),MATCH(ET.county!G$1,ET.region!$A$51:$M$51,0))","v":6.2122047244094487},{"$f":"INDEX(ET.region!$A$51:$M$61,MATCH(ET.county!$B36,ET.region!$A$51:$A$61,0),MATCH(ET.county!H$1,ET.region!$A$51:$M$51,0))","v":6.6968503937007879},{"$f":"INDEX(ET.region!$A$51:$M$61,MATCH(ET.county!$B36,ET.region!$A$51:$A$61,0),MATCH(ET.county!I$1,ET.region!$A$51:$M$51,0))","v":6.9444881889763792},{"$f":"INDEX(ET.region!$A$51:$M$61,MATCH(ET.county!$B36,ET.region!$A$51:$A$61,0),MATCH(ET.county!J$1,ET.region!$A$51:$M$51,0))","v":6.2122047244094487},{"$f":"INDEX(ET.region!$A$51:$M$61,MATCH(ET.county!$B36,ET.region!$A$51:$A$61,0),MATCH(ET.county!K$1,ET.region!$A$51:$M$51,0))","v":4.7598425196850407},{"$f":"INDEX(ET.region!$A$51:$M$61,MATCH(ET.county!$B36,ET.region!$A$51:$A$61,0),MATCH(ET.county!L$1,ET.region!$A$51:$M$51,0))","v":3.4417322834645669},{"$f":"INDEX(ET.region!$A$51:$M$61,MATCH(ET.county!$B36,ET.region!$A$51:$A$61,0),MATCH(ET.county!M$1,ET.region!$A$51:$M$51,0))","v":2.1496062992125986},{"$f":"INDEX(ET.region!$A$51:$M$61,MATCH(ET.county!$B36,ET.region!$A$51:$A$61,0),MATCH(ET.county!N$1,ET.region!$A$51:$M$51,0))","v":1.5133858267716536}]
["Gates","Lewiston",{"$f":"INDEX(ET.region!$A$51:$M$61,MATCH(ET.county!$B37,ET.region!$A$51:$A$61,0),MATCH(ET.county!C$1,ET.region!$A$51:$M$51,0))","v":1.5255905511811025},{"$f":"INDEX(ET.region!$A$51:$M$61,MATCH(ET.county!$B37,ET.region!$A$51:$A$61,0),MATCH(ET.county!D$1,ET.region!$A$51:$M$51,0))","v":2.0173228346456695},{"$f":"INDEX(ET.region!$A$51:$M$61,MATCH(ET.county!$B37,ET.region!$A$51:$A$61,0),MATCH(ET.county!E$1,ET.region!$A$51:$M$51,0))","v":3.4905511811023624},{"$f":"INDEX(ET.region!$A$51:$M$61,MATCH(ET.county!$B37,ET.region!$A$51:$A$61,0),MATCH(ET.county!F$1,ET.region!$A$51:$M$51,0))","v":5.0551181102362204},{"$f":"INDEX(ET.region!$A$51:$M$61,MATCH(ET.county!$B37,ET.region!$A$51:$A$61,0),MATCH(ET.county!G$1,ET.region!$A$51:$M$51,0))","v":6.4318897637795267},{"$f":"INDEX(ET.region!$A$51:$M$61,MATCH(ET.county!$B37,ET.region!$A$51:$A$61,0),MATCH(ET.county!H$1,ET.region!$A$51:$M$51,0))","v":7.0748031496063},{"$f":"INDEX(ET.region!$A$51:$M$61,MATCH(ET.county!$B37,ET.region!$A$51:$A$61,0),MATCH(ET.county!I$1,ET.region!$A$51:$M$51,0))","v":7.359448818897639},{"$f":"INDEX(ET.region!$A$51:$M$61,MATCH(ET.county!$B37,ET.region!$A$51:$A$61,0),MATCH(ET.county!J$1,ET.region!$A$51:$M$51,0))","v":6.566141732283465},{"$f":"INDEX(ET.region!$A$51:$M$61,MATCH(ET.county!$B37,ET.region!$A$51:$A$61,0),MATCH(ET.county!K$1,ET.region!$A$51:$M$51,0))","v":4.9488188976377963},{"$f":"INDEX(ET.region!$A$51:$M$61,MATCH(ET.county!$B37,ET.region!$A$51:$A$61,0),MATCH(ET.county!L$1,ET.region!$A$51:$M$51,0))","v":3.5759842519685043},{"$f":"INDEX(ET.region!$A$51:$M$61,MATCH(ET.county!$B37,ET.region!$A$51:$A$61,0),MATCH(ET.county!M$1,ET.region!$A$51:$M$51,0))","v":2.1968503937007875},{"$f":"INDEX(ET.region!$A$51:$M$61,MATCH(ET.county!$B37,ET.region!$A$51:$A$61,0),MATCH(ET.county!N$1,ET.region!$A$51:$M$51,0))","v":1.5255905511811025}]
["Gaston ","Salisbury",{"$f":"INDEX(ET.region!$A$51:$M$61,MATCH(ET.county!$B38,ET.region!$A$51:$A$61,0),MATCH(ET.county!C$1,ET.region!$A$51:$M$51,0))","v":1.4889763779527558},{"$f":"INDEX(ET.region!$A$51:$M$61,MATCH(ET.county!$B38,ET.region!$A$51:$A$61,0),MATCH(ET.county!D$1,ET.region!$A$51:$M$51,0))","v":1.9401574803149606},{"$f":"INDEX(ET.region!$A$51:$M$61,MATCH(ET.county!$B38,ET.region!$A$51:$A$61,0),MATCH(ET.county!E$1,ET.region!$A$51:$M$51,0))","v":3.2952755905511819},{"$f":"INDEX(ET.region!$A$51:$M$61,MATCH(ET.county!$B38,ET.region!$A$51:$A$61,0),MATCH(ET.county!F$1,ET.region!$A$51:$M$51,0))","v":4.7007874015748037},{"$f":"INDEX(ET.region!$A$51:$M$61,MATCH(ET.county!$B38,ET.region!$A$51:$A$61,0),MATCH(ET.county!G$1,ET.region!$A$51:$M$51,0))","v":6.0169291338582678},{"$f":"INDEX(ET.region!$A$51:$M$61,MATCH(ET.county!$B38,ET.region!$A$51:$A$61,0),MATCH(ET.county!H$1,ET.region!$A$51:$M$51,0))","v":6.6496062992125982},{"$f":"INDEX(ET.region!$A$51:$M$61,MATCH(ET.county!$B38,ET.region!$A$51:$A$61,0),MATCH(ET.county!I$1,ET.region!$A$51:$M$51,0))","v":6.9322834645669289},{"$f":"INDEX(ET.region!$A$51:$M$61,MATCH(ET.county!$B38,ET.region!$A$51:$A$61,0),MATCH(ET.county!J$1,ET.region!$A$51:$M$51,0))","v":6.1755905511811022},{"$f":"INDEX(ET.region!$A$51:$M$61,MATCH(ET.county!$B38,ET.region!$A$51:$A$61,0),MATCH(ET.county!K$1,ET.region!$A$51:$M$51,0))","v":4.7125984251968509},{"$f":"INDEX(ET.region!$A$51:$M$61,MATCH(ET.county!$B38,ET.region!$A$51:$A$61,0),MATCH(ET.county!L$1,ET.region!$A$51:$M$51,0))","v":3.4173228346456694},{"$f":"INDEX(ET.region!$A$51:$M$61,MATCH(ET.county!$B38,ET.region!$A$51:$A$61,0),MATCH(ET.county!M$1,ET.region!$A$51:$M$51,0))","v":2.1141732283464569},{"$f":"INDEX(ET.region!$A$51:$M$61,MATCH(ET.county!$B38,ET.region!$A$51:$A$61,0),MATCH(ET.county!N$1,ET.region!$A$51:$M$51,0))","v":1.4523622047244096}]
["Graham ","Fletcher",{"$f":"INDEX(ET.region!$A$51:$M$61,MATCH(ET.county!$B39,ET.region!$A$51:$A$61,0),MATCH(ET.county!C$1,ET.region!$A$51:$M$51,0))","v":1.3913385826771654},{"$f":"INDEX(ET.region!$A$51:$M$61,MATCH(ET.county!$B39,ET.region!$A$51:$A$61,0),MATCH(ET.county!D$1,ET.region!$A$51:$M$51,0))","v":1.7748031496062995},{"$f":"INDEX(ET.region!$A$51:$M$61,MATCH(ET.county!$B39,ET.region!$A$51:$A$61,0),MATCH(ET.county!E$1,ET.region!$A$51:$M$51,0))","v":3.0633858267716536},{"$f":"INDEX(ET.region!$A$51:$M$61,MATCH(ET.county!$B39,ET.region!$A$51:$A$61,0),MATCH(ET.county!F$1,ET.region!$A$51:$M$51,0))","v":4.4173228346456694},{"$f":"INDEX(ET.region!$A$51:$M$61,MATCH(ET.county!$B39,ET.region!$A$51:$A$61,0),MATCH(ET.county!G$1,ET.region!$A$51:$M$51,0))","v":5.7362204724409454},{"$f":"INDEX(ET.region!$A$51:$M$61,MATCH(ET.county!$B39,ET.region!$A$51:$A$61,0),MATCH(ET.county!H$1,ET.region!$A$51:$M$51,0))","v":6.3070866141732287},{"$f":"INDEX(ET.region!$A$51:$M$61,MATCH(ET.county!$B39,ET.region!$A$51:$A$61,0),MATCH(ET.county!I$1,ET.region!$A$51:$M$51,0))","v":6.5417322834645679},{"$f":"INDEX(ET.region!$A$51:$M$61,MATCH(ET.county!$B39,ET.region!$A$51:$A$61,0),MATCH(ET.county!J$1,ET.region!$A$51:$M$51,0))","v":5.9314960629921272},{"$f":"INDEX(ET.region!$A$51:$M$61,MATCH(ET.county!$B39,ET.region!$A$51:$A$61,0),MATCH(ET.county!K$1,ET.region!$A$51:$M$51,0))","v":4.5118110236220472},{"$f":"INDEX(ET.region!$A$51:$M$61,MATCH(ET.county!$B39,ET.region!$A$51:$A$61,0),MATCH(ET.county!L$1,ET.region!$A$51:$M$51,0))","v":3.270866141732284},{"$f":"INDEX(ET.region!$A$51:$M$61,MATCH(ET.county!$B39,ET.region!$A$51:$A$61,0),MATCH(ET.county!M$1,ET.region!$A$51:$M$51,0))","v":1.9724409448818898},{"$f":"INDEX(ET.region!$A$51:$M$61,MATCH(ET.county!$B39,ET.region!$A$51:$A$61,0),MATCH(ET.county!N$1,ET.region!$A$51:$M$51,0))","v":1.3547244094488189}]
["Granville ","Reidsville",{"$f":"INDEX(ET.region!$A$51:$M$61,MATCH(ET.county!$B40,ET.region!$A$51:$A$61,0),MATCH(ET.county!C$1,ET.region!$A$51:$M$51,0))","v":1.3425196850393704},{"$f":"INDEX(ET.region!$A$51:$M$61,MATCH(ET.county!$B40,ET.region!$A$51:$A$61,0),MATCH(ET.county!D$1,ET.region!$A$51:$M$51,0))","v":1.7637795275590555},{"$f":"INDEX(ET.region!$A$51:$M$61,MATCH(ET.county!$B40,ET.region!$A$51:$A$61,0),MATCH(ET.county!E$1,ET.region!$A$51:$M$51,0))","v":3.0877952755905511},{"$f":"INDEX(ET.region!$A$51:$M$61,MATCH(ET.county!$B40,ET.region!$A$51:$A$61,0),MATCH(ET.county!F$1,ET.region!$A$51:$M$51,0))","v":4.4763779527559056},{"$f":"INDEX(ET.region!$A$51:$M$61,MATCH(ET.county!$B40,ET.region!$A$51:$A$61,0),MATCH(ET.county!G$1,ET.region!$A$51:$M$51,0))","v":5.8216535433070868},{"$f":"INDEX(ET.region!$A$51:$M$61,MATCH(ET.county!$B40,ET.region!$A$51:$A$61,0),MATCH(ET.county!H$1,ET.region!$A$51:$M$51,0))","v":6.4842519685039379},{"$f":"INDEX(ET.region!$A$51:$M$61,MATCH(ET.county!$B40,ET.region!$A$51:$A$61,0),MATCH(ET.county!I$1,ET.region!$A$51:$M$51,0))","v":6.8346456692913389},{"$f":"INDEX(ET.region!$A$51:$M$61,MATCH(ET.county!$B40,ET.region!$A$51:$A$61,0),MATCH(ET.county!J$1,ET.region!$A$51:$M$51,0))","v":6.1267716535433072},{"$f":"INDEX(ET.region!$A$51:$M$61,MATCH(ET.county!$B40,ET.region!$A$51:$A$61,0),MATCH(ET.county!K$1,ET.region!$A$51:$M$51,0))","v":4.5826771653543314},{"$f":"INDEX(ET.region!$A$51:$M$61,MATCH(ET.county!$B40,ET.region!$A$51:$A$61,0),MATCH(ET.county!L$1,ET.region!$A$51:$M$51,0))","v":3.246456692913386},{"$f":"INDEX(ET.region!$A$51:$M$61,MATCH(ET.county!$B40,ET.region!$A$51:$A$61,0),MATCH(ET.county!M$1,ET.region!$A$51:$M$51,0))","v":1.9488188976377951},{"$f":"INDEX(ET.region!$A$51:$M$61,MATCH(ET.county!$B40,ET.region!$A$51:$A$61,0),MATCH(ET.county!N$1,ET.region!$A$51:$M$51,0))","v":1.3181102362204726}]
["Greene","Goldsboro",{"$f":"INDEX(ET.region!$A$51:$M$61,MATCH(ET.county!$B41,ET.region!$A$51:$A$61,0),MATCH(ET.county!C$1,ET.region!$A$51:$M$51,0))","v":1.5744094488188978},{"$f":"INDEX(ET.region!$A$51:$M$61,MATCH(ET.county!$B41,ET.region!$A$51:$A$61,0),MATCH(ET.county!D$1,ET.region!$A$51:$M$51,0))","v":2.0173228346456695},{"$f":"INDEX(ET.region!$A$51:$M$61,MATCH(ET.county!$B41,ET.region!$A$51:$A$61,0),MATCH(ET.county!E$1,ET.region!$A$51:$M$51,0))","v":3.4661417322834644},{"$f":"INDEX(ET.region!$A$51:$M$61,MATCH(ET.county!$B41,ET.region!$A$51:$A$61,0),MATCH(ET.county!F$1,ET.region!$A$51:$M$51,0))","v":4.877952755905512},{"$f":"INDEX(ET.region!$A$51:$M$61,MATCH(ET.county!$B41,ET.region!$A$51:$A$61,0),MATCH(ET.county!G$1,ET.region!$A$51:$M$51,0))","v":6.2976377952755911},{"$f":"INDEX(ET.region!$A$51:$M$61,MATCH(ET.county!$B41,ET.region!$A$51:$A$61,0),MATCH(ET.county!H$1,ET.region!$A$51:$M$51,0))","v":6.6968503937007879},{"$f":"INDEX(ET.region!$A$51:$M$61,MATCH(ET.county!$B41,ET.region!$A$51:$A$61,0),MATCH(ET.county!I$1,ET.region!$A$51:$M$51,0))","v":6.8346456692913389},{"$f":"INDEX(ET.region!$A$51:$M$61,MATCH(ET.county!$B41,ET.region!$A$51:$A$61,0),MATCH(ET.county!J$1,ET.region!$A$51:$M$51,0))","v":6.1145669291338578},{"$f":"INDEX(ET.region!$A$51:$M$61,MATCH(ET.county!$B41,ET.region!$A$51:$A$61,0),MATCH(ET.county!K$1,ET.region!$A$51:$M$51,0))","v":4.7125984251968509},{"$f":"INDEX(ET.region!$A$51:$M$61,MATCH(ET.county!$B41,ET.region!$A$51:$A$61,0),MATCH(ET.county!L$1,ET.region!$A$51:$M$51,0))","v":3.4661417322834644},{"$f":"INDEX(ET.region!$A$51:$M$61,MATCH(ET.county!$B41,ET.region!$A$51:$A$61,0),MATCH(ET.county!M$1,ET.region!$A$51:$M$51,0))","v":2.1968503937007875},{"$f":"INDEX(ET.region!$A$51:$M$61,MATCH(ET.county!$B41,ET.region!$A$51:$A$61,0),MATCH(ET.county!N$1,ET.region!$A$51:$M$51,0))","v":1.55}]
["Guilford ","Reidsville",{"$f":"INDEX(ET.region!$A$51:$M$61,MATCH(ET.county!$B42,ET.region!$A$51:$A$61,0),MATCH(ET.county!C$1,ET.region!$A$51:$M$51,0))","v":1.3425196850393704},{"$f":"INDEX(ET.region!$A$51:$M$61,MATCH(ET.county!$B42,ET.region!$A$51:$A$61,0),MATCH(ET.county!D$1,ET.region!$A$51:$M$51,0))","v":1.7637795275590555},{"$f":"INDEX(ET.region!$A$51:$M$61,MATCH(ET.county!$B42,ET.region!$A$51:$A$61,0),MATCH(ET.county!E$1,ET.region!$A$51:$M$51,0))","v":3.0877952755905511},{"$f":"INDEX(ET.region!$A$51:$M$61,MATCH(ET.county!$B42,ET.region!$A$51:$A$61,0),MATCH(ET.county!F$1,ET.region!$A$51:$M$51,0))","v":4.4763779527559056},{"$f":"INDEX(ET.region!$A$51:$M$61,MATCH(ET.county!$B42,ET.region!$A$51:$A$61,0),MATCH(ET.county!G$1,ET.region!$A$51:$M$51,0))","v":5.8216535433070868},{"$f":"INDEX(ET.region!$A$51:$M$61,MATCH(ET.county!$B42,ET.region!$A$51:$A$61,0),MATCH(ET.county!H$1,ET.region!$A$51:$M$51,0))","v":6.4842519685039379},{"$f":"INDEX(ET.region!$A$51:$M$61,MATCH(ET.county!$B42,ET.region!$A$51:$A$61,0),MATCH(ET.county!I$1,ET.region!$A$51:$M$51,0))","v":6.8346456692913389},{"$f":"INDEX(ET.region!$A$51:$M$61,MATCH(ET.county!$B42,ET.region!$A$51:$A$61,0),MATCH(ET.county!J$1,ET.region!$A$51:$M$51,0))","v":6.1267716535433072},{"$f":"INDEX(ET.region!$A$51:$M$61,MATCH(ET.county!$B42,ET.region!$A$51:$A$61,0),MATCH(ET.county!K$1,ET.region!$A$51:$M$51,0))","v":4.5826771653543314},{"$f":"INDEX(ET.region!$A$51:$M$61,MATCH(ET.county!$B42,ET.region!$A$51:$A$61,0),MATCH(ET.county!L$1,ET.region!$A$51:$M$51,0))","v":3.246456692913386},{"$f":"INDEX(ET.region!$A$51:$M$61,MATCH(ET.county!$B42,ET.region!$A$51:$A$61,0),MATCH(ET.county!M$1,ET.region!$A$51:$M$51,0))","v":1.9488188976377951},{"$f":"INDEX(ET.region!$A$51:$M$61,MATCH(ET.county!$B42,ET.region!$A$51:$A$61,0),MATCH(ET.county!N$1,ET.region!$A$51:$M$51,0))","v":1.3181102362204726}]
["Halifax ","Lewiston",{"$f":"INDEX(ET.region!$A$51:$M$61,MATCH(ET.county!$B43,ET.region!$A$51:$A$61,0),MATCH(ET.county!C$1,ET.region!$A$51:$M$51,0))","v":1.5255905511811025},{"$f":"INDEX(ET.region!$A$51:$M$61,MATCH(ET.county!$B43,ET.region!$A$51:$A$61,0),MATCH(ET.county!D$1,ET.region!$A$51:$M$51,0))","v":2.0173228346456695},{"$f":"INDEX(ET.region!$A$51:$M$61,MATCH(ET.county!$B43,ET.region!$A$51:$A$61,0),MATCH(ET.county!E$1,ET.region!$A$51:$M$51,0))","v":3.4905511811023624},{"$f":"INDEX(ET.region!$A$51:$M$61,MATCH(ET.county!$B43,ET.region!$A$51:$A$61,0),MATCH(ET.county!F$1,ET.region!$A$51:$M$51,0))","v":5.0551181102362204},{"$f":"INDEX(ET.region!$A$51:$M$61,MATCH(ET.county!$B43,ET.region!$A$51:$A$61,0),MATCH(ET.county!G$1,ET.region!$A$51:$M$51,0))","v":6.4318897637795267},{"$f":"INDEX(ET.region!$A$51:$M$61,MATCH(ET.county!$B43,ET.region!$A$51:$A$61,0),MATCH(ET.county!H$1,ET.region!$A$51:$M$51,0))","v":7.0748031496063},{"$f":"INDEX(ET.region!$A$51:$M$61,MATCH(ET.county!$B43,ET.region!$A$51:$A$61,0),MATCH(ET.county!I$1,ET.region!$A$51:$M$51,0))","v":7.359448818897639},{"$f":"INDEX(ET.region!$A$51:$M$61,MATCH(ET.county!$B43,ET.region!$A$51:$A$61,0),MATCH(ET.county!J$1,ET.region!$A$51:$M$51,0))","v":6.566141732283465},{"$f":"INDEX(ET.region!$A$51:$M$61,MATCH(ET.county!$B43,ET.region!$A$51:$A$61,0),MATCH(ET.county!K$1,ET.region!$A$51:$M$51,0))","v":4.9488188976377963},{"$f":"INDEX(ET.region!$A$51:$M$61,MATCH(ET.county!$B43,ET.region!$A$51:$A$61,0),MATCH(ET.county!L$1,ET.region!$A$51:$M$51,0))","v":3.5759842519685043},{"$f":"INDEX(ET.region!$A$51:$M$61,MATCH(ET.county!$B43,ET.region!$A$51:$A$61,0),MATCH(ET.county!M$1,ET.region!$A$51:$M$51,0))","v":2.1968503937007875},{"$f":"INDEX(ET.region!$A$51:$M$61,MATCH(ET.county!$B43,ET.region!$A$51:$A$61,0),MATCH(ET.county!N$1,ET.region!$A$51:$M$51,0))","v":1.5255905511811025}]
["Harnett ","Raleigh",{"$f":"INDEX(ET.region!$A$51:$M$61,MATCH(ET.county!$B44,ET.region!$A$51:$A$61,0),MATCH(ET.county!C$1,ET.region!$A$51:$M$51,0))","v":1.562204724409449},{"$f":"INDEX(ET.region!$A$51:$M$61,MATCH(ET.county!$B44,ET.region!$A$51:$A$61,0),MATCH(ET.county!D$1,ET.region!$A$51:$M$51,0))","v":2.0503937007874016},{"$f":"INDEX(ET.region!$A$51:$M$61,MATCH(ET.county!$B44,ET.region!$A$51:$A$61,0),MATCH(ET.county!E$1,ET.region!$A$51:$M$51,0))","v":3.5027559055118114},{"$f":"INDEX(ET.region!$A$51:$M$61,MATCH(ET.county!$B44,ET.region!$A$51:$A$61,0),MATCH(ET.county!F$1,ET.region!$A$51:$M$51,0))","v":4.9370078740157481},{"$f":"INDEX(ET.region!$A$51:$M$61,MATCH(ET.county!$B44,ET.region!$A$51:$A$61,0),MATCH(ET.county!G$1,ET.region!$A$51:$M$51,0))","v":6.2122047244094487},{"$f":"INDEX(ET.region!$A$51:$M$61,MATCH(ET.county!$B44,ET.region!$A$51:$A$61,0),MATCH(ET.county!H$1,ET.region!$A$51:$M$51,0))","v":6.6968503937007879},{"$f":"INDEX(ET.region!$A$51:$M$61,MATCH(ET.county!$B44,ET.region!$A$51:$A$61,0),MATCH(ET.county!I$1,ET.region!$A$51:$M$51,0))","v":6.9444881889763792},{"$f":"INDEX(ET.region!$A$51:$M$61,MATCH(ET.county!$B44,ET.region!$A$51:$A$61,0),MATCH(ET.county!J$1,ET.region!$A$51:$M$51,0))","v":6.2122047244094487},{"$f":"INDEX(ET.region!$A$51:$M$61,MATCH(ET.county!$B44,ET.region!$A$51:$A$61,0),MATCH(ET.county!K$1,ET.region!$A$51:$M$51,0))","v":4.7598425196850407},{"$f":"INDEX(ET.region!$A$51:$M$61,MATCH(ET.county!$B44,ET.region!$A$51:$A$61,0),MATCH(ET.county!L$1,ET.region!$A$51:$M$51,0))","v":3.4417322834645669},{"$f":"INDEX(ET.region!$A$51:$M$61,MATCH(ET.county!$B44,ET.region!$A$51:$A$61,0),MATCH(ET.county!M$1,ET.region!$A$51:$M$51,0))","v":2.1496062992125986},{"$f":"INDEX(ET.region!$A$51:$M$61,MATCH(ET.county!$B44,ET.region!$A$51:$A$61,0),MATCH(ET.county!N$1,ET.region!$A$51:$M$51,0))","v":1.5133858267716536}]
["Haywood ","Fletcher",{"$f":"INDEX(ET.region!$A$51:$M$61,MATCH(ET.county!$B45,ET.region!$A$51:$A$61,0),MATCH(ET.county!C$1,ET.region!$A$51:$M$51,0))","v":1.3913385826771654},{"$f":"INDEX(ET.region!$A$51:$M$61,MATCH(ET.county!$B45,ET.region!$A$51:$A$61,0),MATCH(ET.county!D$1,ET.region!$A$51:$M$51,0))","v":1.7748031496062995},{"$f":"INDEX(ET.region!$A$51:$M$61,MATCH(ET.county!$B45,ET.region!$A$51:$A$61,0),MATCH(ET.county!E$1,ET.region!$A$51:$M$51,0))","v":3.0633858267716536},{"$f":"INDEX(ET.region!$A$51:$M$61,MATCH(ET.county!$B45,ET.region!$A$51:$A$61,0),MATCH(ET.county!F$1,ET.region!$A$51:$M$51,0))","v":4.4173228346456694},{"$f":"INDEX(ET.region!$A$51:$M$61,MATCH(ET.county!$B45,ET.region!$A$51:$A$61,0),MATCH(ET.county!G$1,ET.region!$A$51:$M$51,0))","v":5.7362204724409454},{"$f":"INDEX(ET.region!$A$51:$M$61,MATCH(ET.county!$B45,ET.region!$A$51:$A$61,0),MATCH(ET.county!H$1,ET.region!$A$51:$M$51,0))","v":6.3070866141732287},{"$f":"INDEX(ET.region!$A$51:$M$61,MATCH(ET.county!$B45,ET.region!$A$51:$A$61,0),MATCH(ET.county!I$1,ET.region!$A$51:$M$51,0))","v":6.5417322834645679},{"$f":"INDEX(ET.region!$A$51:$M$61,MATCH(ET.county!$B45,ET.region!$A$51:$A$61,0),MATCH(ET.county!J$1,ET.region!$A$51:$M$51,0))","v":5.9314960629921272},{"$f":"INDEX(ET.region!$A$51:$M$61,MATCH(ET.county!$B45,ET.region!$A$51:$A$61,0),MATCH(ET.county!K$1,ET.region!$A$51:$M$51,0))","v":4.5118110236220472},{"$f":"INDEX(ET.region!$A$51:$M$61,MATCH(ET.county!$B45,ET.region!$A$51:$A$61,0),MATCH(ET.county!L$1,ET.region!$A$51:$M$51,0))","v":3.270866141732284},{"$f":"INDEX(ET.region!$A$51:$M$61,MATCH(ET.county!$B45,ET.region!$A$51:$A$61,0),MATCH(ET.county!M$1,ET.region!$A$51:$M$51,0))","v":1.9724409448818898},{"$f":"INDEX(ET.region!$A$51:$M$61,MATCH(ET.county!$B45,ET.region!$A$51:$A$61,0),MATCH(ET.county!N$1,ET.region!$A$51:$M$51,0))","v":1.3547244094488189}]
["Henderson ","fletcher",{"$f":"INDEX(ET.region!$A$51:$M$61,MATCH(ET.county!$B46,ET.region!$A$51:$A$61,0),MATCH(ET.county!C$1,ET.region!$A$51:$M$51,0))","v":1.3913385826771654},{"$f":"INDEX(ET.region!$A$51:$M$61,MATCH(ET.county!$B46,ET.region!$A$51:$A$61,0),MATCH(ET.county!D$1,ET.region!$A$51:$M$51,0))","v":1.7748031496062995},{"$f":"INDEX(ET.region!$A$51:$M$61,MATCH(ET.county!$B46,ET.region!$A$51:$A$61,0),MATCH(ET.county!E$1,ET.region!$A$51:$M$51,0))","v":3.0633858267716536},{"$f":"INDEX(ET.region!$A$51:$M$61,MATCH(ET.county!$B46,ET.region!$A$51:$A$61,0),MATCH(ET.county!F$1,ET.region!$A$51:$M$51,0))","v":4.4173228346456694},{"$f":"INDEX(ET.region!$A$51:$M$61,MATCH(ET.county!$B46,ET.region!$A$51:$A$61,0),MATCH(ET.county!G$1,ET.region!$A$51:$M$51,0))","v":5.7362204724409454},{"$f":"INDEX(ET.region!$A$51:$M$61,MATCH(ET.county!$B46,ET.region!$A$51:$A$61,0),MATCH(ET.county!H$1,ET.region!$A$51:$M$51,0))","v":6.3070866141732287},{"$f":"INDEX(ET.region!$A$51:$M$61,MATCH(ET.county!$B46,ET.region!$A$51:$A$61,0),MATCH(ET.county!I$1,ET.region!$A$51:$M$51,0))","v":6.5417322834645679},{"$f":"INDEX(ET.region!$A$51:$M$61,MATCH(ET.county!$B46,ET.region!$A$51:$A$61,0),MATCH(ET.county!J$1,ET.region!$A$51:$M$51,0))","v":5.9314960629921272},{"$f":"INDEX(ET.region!$A$51:$M$61,MATCH(ET.county!$B46,ET.region!$A$51:$A$61,0),MATCH(ET.county!K$1,ET.region!$A$51:$M$51,0))","v":4.5118110236220472},{"$f":"INDEX(ET.region!$A$51:$M$61,MATCH(ET.county!$B46,ET.region!$A$51:$A$61,0),MATCH(ET.county!L$1,ET.region!$A$51:$M$51,0))","v":3.270866141732284},{"$f":"INDEX(ET.region!$A$51:$M$61,MATCH(ET.county!$B46,ET.region!$A$51:$A$61,0),MATCH(ET.county!M$1,ET.region!$A$51:$M$51,0))","v":1.9724409448818898},{"$f":"INDEX(ET.region!$A$51:$M$61,MATCH(ET.county!$B46,ET.region!$A$51:$A$61,0),MATCH(ET.county!N$1,ET.region!$A$51:$M$51,0))","v":1.3547244094488189}]
["Hertford ","Lewiston",{"$f":"INDEX(ET.region!$A$51:$M$61,MATCH(ET.county!$B47,ET.region!$A$51:$A$61,0),MATCH(ET.county!C$1,ET.region!$A$51:$M$51,0))","v":1.5255905511811025},{"$f":"INDEX(ET.region!$A$51:$M$61,MATCH(ET.county!$B47,ET.region!$A$51:$A$61,0),MATCH(ET.county!D$1,ET.region!$A$51:$M$51,0))","v":2.0173228346456695},{"$f":"INDEX(ET.region!$A$51:$M$61,MATCH(ET.county!$B47,ET.region!$A$51:$A$61,0),MATCH(ET.county!E$1,ET.region!$A$51:$M$51,0))","v":3.4905511811023624},{"$f":"INDEX(ET.region!$A$51:$M$61,MATCH(ET.county!$B47,ET.region!$A$51:$A$61,0),MATCH(ET.county!F$1,ET.region!$A$51:$M$51,0))","v":5.0551181102362204},{"$f":"INDEX(ET.region!$A$51:$M$61,MATCH(ET.county!$B47,ET.region!$A$51:$A$61,0),MATCH(ET.county!G$1,ET.region!$A$51:$M$51,0))","v":6.4318897637795267},{"$f":"INDEX(ET.region!$A$51:$M$61,MATCH(ET.county!$B47,ET.region!$A$51:$A$61,0),MATCH(ET.county!H$1,ET.region!$A$51:$M$51,0))","v":7.0748031496063},{"$f":"INDEX(ET.region!$A$51:$M$61,MATCH(ET.county!$B47,ET.region!$A$51:$A$61,0),MATCH(ET.county!I$1,ET.region!$A$51:$M$51,0))","v":7.359448818897639},{"$f":"INDEX(ET.region!$A$51:$M$61,MATCH(ET.county!$B47,ET.region!$A$51:$A$61,0),MATCH(ET.county!J$1,ET.region!$A$51:$M$51,0))","v":6.566141732283465},{"$f":"INDEX(ET.region!$A$51:$M$61,MATCH(ET.county!$B47,ET.region!$A$51:$A$61,0),MATCH(ET.county!K$1,ET.region!$A$51:$M$51,0))","v":4.9488188976377963},{"$f":"INDEX(ET.region!$A$51:$M$61,MATCH(ET.county!$B47,ET.region!$A$51:$A$61,0),MATCH(ET.county!L$1,ET.region!$A$51:$M$51,0))","v":3.5759842519685043},{"$f":"INDEX(ET.region!$A$51:$M$61,MATCH(ET.county!$B47,ET.region!$A$51:$A$61,0),MATCH(ET.county!M$1,ET.region!$A$51:$M$51,0))","v":2.1968503937007875},{"$f":"INDEX(ET.region!$A$51:$M$61,MATCH(ET.county!$B47,ET.region!$A$51:$A$61,0),MATCH(ET.county!N$1,ET.region!$A$51:$M$51,0))","v":1.5255905511811025}]
["Hoke","Jackson.Springs",{"$f":"INDEX(ET.region!$A$51:$M$61,MATCH(ET.county!$B48,ET.region!$A$51:$A$61,0),MATCH(ET.county!C$1,ET.region!$A$51:$M$51,0))","v":1.5011811023622048},{"$f":"INDEX(ET.region!$A$51:$M$61,MATCH(ET.county!$B48,ET.region!$A$51:$A$61,0),MATCH(ET.county!D$1,ET.region!$A$51:$M$51,0))","v":1.9622047244094489},{"$f":"INDEX(ET.region!$A$51:$M$61,MATCH(ET.county!$B48,ET.region!$A$51:$A$61,0),MATCH(ET.county!E$1,ET.region!$A$51:$M$51,0))","v":3.4051181102362205},{"$f":"INDEX(ET.region!$A$51:$M$61,MATCH(ET.county!$B48,ET.region!$A$51:$A$61,0),MATCH(ET.county!F$1,ET.region!$A$51:$M$51,0))","v":4.8661417322834648},{"$f":"INDEX(ET.region!$A$51:$M$61,MATCH(ET.county!$B48,ET.region!$A$51:$A$61,0),MATCH(ET.county!G$1,ET.region!$A$51:$M$51,0))","v":6.1755905511811022},{"$f":"INDEX(ET.region!$A$51:$M$61,MATCH(ET.county!$B48,ET.region!$A$51:$A$61,0),MATCH(ET.county!H$1,ET.region!$A$51:$M$51,0))","v":6.7440944881889759},{"$f":"INDEX(ET.region!$A$51:$M$61,MATCH(ET.county!$B48,ET.region!$A$51:$A$61,0),MATCH(ET.county!I$1,ET.region!$A$51:$M$51,0))","v":7.0055118110236227},{"$f":"INDEX(ET.region!$A$51:$M$61,MATCH(ET.county!$B48,ET.region!$A$51:$A$61,0),MATCH(ET.county!J$1,ET.region!$A$51:$M$51,0))","v":6.2244094488188981},{"$f":"INDEX(ET.region!$A$51:$M$61,MATCH(ET.county!$B48,ET.region!$A$51:$A$61,0),MATCH(ET.county!K$1,ET.region!$A$51:$M$51,0))","v":4.771653543307087},{"$f":"INDEX(ET.region!$A$51:$M$61,MATCH(ET.county!$B48,ET.region!$A$51:$A$61,0),MATCH(ET.county!L$1,ET.region!$A$51:$M$51,0))","v":3.4051181102362205},{"$f":"INDEX(ET.region!$A$51:$M$61,MATCH(ET.county!$B48,ET.region!$A$51:$A$61,0),MATCH(ET.county!M$1,ET.region!$A$51:$M$51,0))","v":2.0905511811023625},{"$f":"INDEX(ET.region!$A$51:$M$61,MATCH(ET.county!$B48,ET.region!$A$51:$A$61,0),MATCH(ET.county!N$1,ET.region!$A$51:$M$51,0))","v":1.4889763779527558}]
["Hyde","Aurora",{"$f":"INDEX(ET.region!$A$51:$M$61,MATCH(ET.county!$B49,ET.region!$A$51:$A$61,0),MATCH(ET.county!C$1,ET.region!$A$51:$M$51,0))","v":1.581},{"$f":"INDEX(ET.region!$A$51:$M$61,MATCH(ET.county!$B49,ET.region!$A$51:$A$61,0),MATCH(ET.county!D$1,ET.region!$A$51:$M$51,0))","v":1.9600000000000002},{"$f":"INDEX(ET.region!$A$51:$M$61,MATCH(ET.county!$B49,ET.region!$A$51:$A$61,0),MATCH(ET.county!E$1,ET.region!$A$51:$M$51,0))","v":3.2549999999999999},{"$f":"INDEX(ET.region!$A$51:$M$61,MATCH(ET.county!$B49,ET.region!$A$51:$A$61,0),MATCH(ET.county!F$1,ET.region!$A$51:$M$51,0))","v":4.59},{"$f":"INDEX(ET.region!$A$51:$M$61,MATCH(ET.county!$B49,ET.region!$A$51:$A$61,0),MATCH(ET.county!G$1,ET.region!$A$51:$M$51,0))","v":5.7969999999999997},{"$f":"INDEX(ET.region!$A$51:$M$61,MATCH(ET.county!$B49,ET.region!$A$51:$A$61,0),MATCH(ET.county!H$1,ET.region!$A$51:$M$51,0))","v":6.2399999999999993},{"$f":"INDEX(ET.region!$A$51:$M$61,MATCH(ET.county!$B49,ET.region!$A$51:$A$61,0),MATCH(ET.county!I$1,ET.region!$A$51:$M$51,0))","v":6.4790000000000001},{"$f":"INDEX(ET.region!$A$51:$M$61,MATCH(ET.county!$B49,ET.region!$A$51:$A$61,0),MATCH(ET.county!J$1,ET.region!$A$51:$M$51,0))","v":5.7350000000000003},{"$f":"INDEX(ET.region!$A$51:$M$61,MATCH(ET.county!$B49,ET.region!$A$51:$A$61,0),MATCH(ET.county!K$1,ET.region!$A$51:$M$51,0))","v":4.38},{"$f":"INDEX(ET.region!$A$51:$M$61,MATCH(ET.county!$B49,ET.region!$A$51:$A$61,0),MATCH(ET.county!L$1,ET.region!$A$51:$M$51,0))","v":3.2549999999999999},{"$f":"INDEX(ET.region!$A$51:$M$61,MATCH(ET.county!$B49,ET.region!$A$51:$A$61,0),MATCH(ET.county!M$1,ET.region!$A$51:$M$51,0))","v":2.0700000000000003},{"$f":"INDEX(ET.region!$A$51:$M$61,MATCH(ET.county!$B49,ET.region!$A$51:$A$61,0),MATCH(ET.county!N$1,ET.region!$A$51:$M$51,0))","v":1.55}]
["Iredell ","Salisbury",{"$f":"INDEX(ET.region!$A$51:$M$61,MATCH(ET.county!$B50,ET.region!$A$51:$A$61,0),MATCH(ET.county!C$1,ET.region!$A$51:$M$51,0))","v":1.4889763779527558},{"$f":"INDEX(ET.region!$A$51:$M$61,MATCH(ET.county!$B50,ET.region!$A$51:$A$61,0),MATCH(ET.county!D$1,ET.region!$A$51:$M$51,0))","v":1.9401574803149606},{"$f":"INDEX(ET.region!$A$51:$M$61,MATCH(ET.county!$B50,ET.region!$A$51:$A$61,0),MATCH(ET.county!E$1,ET.region!$A$51:$M$51,0))","v":3.2952755905511819},{"$f":"INDEX(ET.region!$A$51:$M$61,MATCH(ET.county!$B50,ET.region!$A$51:$A$61,0),MATCH(ET.county!F$1,ET.region!$A$51:$M$51,0))","v":4.7007874015748037},{"$f":"INDEX(ET.region!$A$51:$M$61,MATCH(ET.county!$B50,ET.region!$A$51:$A$61,0),MATCH(ET.county!G$1,ET.region!$A$51:$M$51,0))","v":6.0169291338582678},{"$f":"INDEX(ET.region!$A$51:$M$61,MATCH(ET.county!$B50,ET.region!$A$51:$A$61,0),MATCH(ET.county!H$1,ET.region!$A$51:$M$51,0))","v":6.6496062992125982},{"$f":"INDEX(ET.region!$A$51:$M$61,MATCH(ET.county!$B50,ET.region!$A$51:$A$61,0),MATCH(ET.county!I$1,ET.region!$A$51:$M$51,0))","v":6.9322834645669289},{"$f":"INDEX(ET.region!$A$51:$M$61,MATCH(ET.county!$B50,ET.region!$A$51:$A$61,0),MATCH(ET.county!J$1,ET.region!$A$51:$M$51,0))","v":6.1755905511811022},{"$f":"INDEX(ET.region!$A$51:$M$61,MATCH(ET.county!$B50,ET.region!$A$51:$A$61,0),MATCH(ET.county!K$1,ET.region!$A$51:$M$51,0))","v":4.7125984251968509},{"$f":"INDEX(ET.region!$A$51:$M$61,MATCH(ET.county!$B50,ET.region!$A$51:$A$61,0),MATCH(ET.county!L$1,ET.region!$A$51:$M$51,0))","v":3.4173228346456694},{"$f":"INDEX(ET.region!$A$51:$M$61,MATCH(ET.county!$B50,ET.region!$A$51:$A$61,0),MATCH(ET.county!M$1,ET.region!$A$51:$M$51,0))","v":2.1141732283464569},{"$f":"INDEX(ET.region!$A$51:$M$61,MATCH(ET.county!$B50,ET.region!$A$51:$A$61,0),MATCH(ET.county!N$1,ET.region!$A$51:$M$51,0))","v":1.4523622047244096}]
["Jackson ","Fletcher",{"$f":"INDEX(ET.region!$A$51:$M$61,MATCH(ET.county!$B51,ET.region!$A$51:$A$61,0),MATCH(ET.county!C$1,ET.region!$A$51:$M$51,0))","v":1.3913385826771654},{"$f":"INDEX(ET.region!$A$51:$M$61,MATCH(ET.county!$B51,ET.region!$A$51:$A$61,0),MATCH(ET.county!D$1,ET.region!$A$51:$M$51,0))","v":1.7748031496062995},{"$f":"INDEX(ET.region!$A$51:$M$61,MATCH(ET.county!$B51,ET.region!$A$51:$A$61,0),MATCH(ET.county!E$1,ET.region!$A$51:$M$51,0))","v":3.0633858267716536},{"$f":"INDEX(ET.region!$A$51:$M$61,MATCH(ET.county!$B51,ET.region!$A$51:$A$61,0),MATCH(ET.county!F$1,ET.region!$A$51:$M$51,0))","v":4.4173228346456694},{"$f":"INDEX(ET.region!$A$51:$M$61,MATCH(ET.county!$B51,ET.region!$A$51:$A$61,0),MATCH(ET.county!G$1,ET.region!$A$51:$M$51,0))","v":5.7362204724409454},{"$f":"INDEX(ET.region!$A$51:$M$61,MATCH(ET.county!$B51,ET.region!$A$51:$A$61,0),MATCH(ET.county!H$1,ET.region!$A$51:$M$51,0))","v":6.3070866141732287},{"$f":"INDEX(ET.region!$A$51:$M$61,MATCH(ET.county!$B51,ET.region!$A$51:$A$61,0),MATCH(ET.county!I$1,ET.region!$A$51:$M$51,0))","v":6.5417322834645679},{"$f":"INDEX(ET.region!$A$51:$M$61,MATCH(ET.county!$B51,ET.region!$A$51:$A$61,0),MATCH(ET.county!J$1,ET.region!$A$51:$M$51,0))","v":5.9314960629921272},{"$f":"INDEX(ET.region!$A$51:$M$61,MATCH(ET.county!$B51,ET.region!$A$51:$A$61,0),MATCH(ET.county!K$1,ET.region!$A$51:$M$51,0))","v":4.5118110236220472},{"$f":"INDEX(ET.region!$A$51:$M$61,MATCH(ET.county!$B51,ET.region!$A$51:$A$61,0),MATCH(ET.county!L$1,ET.region!$A$51:$M$51,0))","v":3.270866141732284},{"$f":"INDEX(ET.region!$A$51:$M$61,MATCH(ET.county!$B51,ET.region!$A$51:$A$61,0),MATCH(ET.county!M$1,ET.region!$A$51:$M$51,0))","v":1.9724409448818898},{"$f":"INDEX(ET.region!$A$51:$M$61,MATCH(ET.county!$B51,ET.region!$A$51:$A$61,0),MATCH(ET.county!N$1,ET.region!$A$51:$M$51,0))","v":1.3547244094488189}]
["Johnston ","Raleigh",{"$f":"INDEX(ET.region!$A$51:$M$61,MATCH(ET.county!$B52,ET.region!$A$51:$A$61,0),MATCH(ET.county!C$1,ET.region!$A$51:$M$51,0))","v":1.562204724409449},{"$f":"INDEX(ET.region!$A$51:$M$61,MATCH(ET.county!$B52,ET.region!$A$51:$A$61,0),MATCH(ET.county!D$1,ET.region!$A$51:$M$51,0))","v":2.0503937007874016},{"$f":"INDEX(ET.region!$A$51:$M$61,MATCH(ET.county!$B52,ET.region!$A$51:$A$61,0),MATCH(ET.county!E$1,ET.region!$A$51:$M$51,0))","v":3.5027559055118114},{"$f":"INDEX(ET.region!$A$51:$M$61,MATCH(ET.county!$B52,ET.region!$A$51:$A$61,0),MATCH(ET.county!F$1,ET.region!$A$51:$M$51,0))","v":4.9370078740157481},{"$f":"INDEX(ET.region!$A$51:$M$61,MATCH(ET.county!$B52,ET.region!$A$51:$A$61,0),MATCH(ET.county!G$1,ET.region!$A$51:$M$51,0))","v":6.2122047244094487},{"$f":"INDEX(ET.region!$A$51:$M$61,MATCH(ET.county!$B52,ET.region!$A$51:$A$61,0),MATCH(ET.county!H$1,ET.region!$A$51:$M$51,0))","v":6.6968503937007879},{"$f":"INDEX(ET.region!$A$51:$M$61,MATCH(ET.county!$B52,ET.region!$A$51:$A$61,0),MATCH(ET.county!I$1,ET.region!$A$51:$M$51,0))","v":6.9444881889763792},{"$f":"INDEX(ET.region!$A$51:$M$61,MATCH(ET.county!$B52,ET.region!$A$51:$A$61,0),MATCH(ET.county!J$1,ET.region!$A$51:$M$51,0))","v":6.2122047244094487},{"$f":"INDEX(ET.region!$A$51:$M$61,MATCH(ET.county!$B52,ET.region!$A$51:$A$61,0),MATCH(ET.county!K$1,ET.region!$A$51:$M$51,0))","v":4.7598425196850407},{"$f":"INDEX(ET.region!$A$51:$M$61,MATCH(ET.county!$B52,ET.region!$A$51:$A$61,0),MATCH(ET.county!L$1,ET.region!$A$51:$M$51,0))","v":3.4417322834645669},{"$f":"INDEX(ET.region!$A$51:$M$61,MATCH(ET.county!$B52,ET.region!$A$51:$A$61,0),MATCH(ET.county!M$1,ET.region!$A$51:$M$51,0))","v":2.1496062992125986},{"$f":"INDEX(ET.region!$A$51:$M$61,MATCH(ET.county!$B52,ET.region!$A$51:$A$61,0),MATCH(ET.county!N$1,ET.region!$A$51:$M$51,0))","v":1.5133858267716536}]
["Jones ","Aurora",{"$f":"INDEX(ET.region!$A$51:$M$61,MATCH(ET.county!$B53,ET.region!$A$51:$A$61,0),MATCH(ET.county!C$1,ET.region!$A$51:$M$51,0))","v":1.581},{"$f":"INDEX(ET.region!$A$51:$M$61,MATCH(ET.county!$B53,ET.region!$A$51:$A$61,0),MATCH(ET.county!D$1,ET.region!$A$51:$M$51,0))","v":1.9600000000000002},{"$f":"INDEX(ET.region!$A$51:$M$61,MATCH(ET.county!$B53,ET.region!$A$51:$A$61,0),MATCH(ET.county!E$1,ET.region!$A$51:$M$51,0))","v":3.2549999999999999},{"$f":"INDEX(ET.region!$A$51:$M$61,MATCH(ET.county!$B53,ET.region!$A$51:$A$61,0),MATCH(ET.county!F$1,ET.region!$A$51:$M$51,0))","v":4.59},{"$f":"INDEX(ET.region!$A$51:$M$61,MATCH(ET.county!$B53,ET.region!$A$51:$A$61,0),MATCH(ET.county!G$1,ET.region!$A$51:$M$51,0))","v":5.7969999999999997},{"$f":"INDEX(ET.region!$A$51:$M$61,MATCH(ET.county!$B53,ET.region!$A$51:$A$61,0),MATCH(ET.county!H$1,ET.region!$A$51:$M$51,0))","v":6.2399999999999993},{"$f":"INDEX(ET.region!$A$51:$M$61,MATCH(ET.county!$B53,ET.region!$A$51:$A$61,0),MATCH(ET.county!I$1,ET.region!$A$51:$M$51,0))","v":6.4790000000000001},{"$f":"INDEX(ET.region!$A$51:$M$61,MATCH(ET.county!$B53,ET.region!$A$51:$A$61,0),MATCH(ET.county!J$1,ET.region!$A$51:$M$51,0))","v":5.7350000000000003},{"$f":"INDEX(ET.region!$A$51:$M$61,MATCH(ET.county!$B53,ET.region!$A$51:$A$61,0),MATCH(ET.county!K$1,ET.region!$A$51:$M$51,0))","v":4.38},{"$f":"INDEX(ET.region!$A$51:$M$61,MATCH(ET.county!$B53,ET.region!$A$51:$A$61,0),MATCH(ET.county!L$1,ET.region!$A$51:$M$51,0))","v":3.2549999999999999},{"$f":"INDEX(ET.region!$A$51:$M$61,MATCH(ET.county!$B53,ET.region!$A$51:$A$61,0),MATCH(ET.county!M$1,ET.region!$A$51:$M$51,0))","v":2.0700000000000003},{"$f":"INDEX(ET.region!$A$51:$M$61,MATCH(ET.county!$B53,ET.region!$A$51:$A$61,0),MATCH(ET.county!N$1,ET.region!$A$51:$M$51,0))","v":1.55}]
["Lee ","Raleigh",{"$f":"INDEX(ET.region!$A$51:$M$61,MATCH(ET.county!$B54,ET.region!$A$51:$A$61,0),MATCH(ET.county!C$1,ET.region!$A$51:$M$51,0))","v":1.562204724409449},{"$f":"INDEX(ET.region!$A$51:$M$61,MATCH(ET.county!$B54,ET.region!$A$51:$A$61,0),MATCH(ET.county!D$1,ET.region!$A$51:$M$51,0))","v":2.0503937007874016},{"$f":"INDEX(ET.region!$A$51:$M$61,MATCH(ET.county!$B54,ET.region!$A$51:$A$61,0),MATCH(ET.county!E$1,ET.region!$A$51:$M$51,0))","v":3.5027559055118114},{"$f":"INDEX(ET.region!$A$51:$M$61,MATCH(ET.county!$B54,ET.region!$A$51:$A$61,0),MATCH(ET.county!F$1,ET.region!$A$51:$M$51,0))","v":4.9370078740157481},{"$f":"INDEX(ET.region!$A$51:$M$61,MATCH(ET.county!$B54,ET.region!$A$51:$A$61,0),MATCH(ET.county!G$1,ET.region!$A$51:$M$51,0))","v":6.2122047244094487},{"$f":"INDEX(ET.region!$A$51:$M$61,MATCH(ET.county!$B54,ET.region!$A$51:$A$61,0),MATCH(ET.county!H$1,ET.region!$A$51:$M$51,0))","v":6.6968503937007879},{"$f":"INDEX(ET.region!$A$51:$M$61,MATCH(ET.county!$B54,ET.region!$A$51:$A$61,0),MATCH(ET.county!I$1,ET.region!$A$51:$M$51,0))","v":6.9444881889763792},{"$f":"INDEX(ET.region!$A$51:$M$61,MATCH(ET.county!$B54,ET.region!$A$51:$A$61,0),MATCH(ET.county!J$1,ET.region!$A$51:$M$51,0))","v":6.2122047244094487},{"$f":"INDEX(ET.region!$A$51:$M$61,MATCH(ET.county!$B54,ET.region!$A$51:$A$61,0),MATCH(ET.county!K$1,ET.region!$A$51:$M$51,0))","v":4.7598425196850407},{"$f":"INDEX(ET.region!$A$51:$M$61,MATCH(ET.county!$B54,ET.region!$A$51:$A$61,0),MATCH(ET.county!L$1,ET.region!$A$51:$M$51,0))","v":3.4417322834645669},{"$f":"INDEX(ET.region!$A$51:$M$61,MATCH(ET.county!$B54,ET.region!$A$51:$A$61,0),MATCH(ET.county!M$1,ET.region!$A$51:$M$51,0))","v":2.1496062992125986},{"$f":"INDEX(ET.region!$A$51:$M$61,MATCH(ET.county!$B54,ET.region!$A$51:$A$61,0),MATCH(ET.county!N$1,ET.region!$A$51:$M$51,0))","v":1.5133858267716536}]
["Lenoir ","Goldsboro",{"$f":"INDEX(ET.region!$A$51:$M$61,MATCH(ET.county!$B55,ET.region!$A$51:$A$61,0),MATCH(ET.county!C$1,ET.region!$A$51:$M$51,0))","v":1.5744094488188978},{"$f":"INDEX(ET.region!$A$51:$M$61,MATCH(ET.county!$B55,ET.region!$A$51:$A$61,0),MATCH(ET.county!D$1,ET.region!$A$51:$M$51,0))","v":2.0173228346456695},{"$f":"INDEX(ET.region!$A$51:$M$61,MATCH(ET.county!$B55,ET.region!$A$51:$A$61,0),MATCH(ET.county!E$1,ET.region!$A$51:$M$51,0))","v":3.4661417322834644},{"$f":"INDEX(ET.region!$A$51:$M$61,MATCH(ET.county!$B55,ET.region!$A$51:$A$61,0),MATCH(ET.county!F$1,ET.region!$A$51:$M$51,0))","v":4.877952755905512},{"$f":"INDEX(ET.region!$A$51:$M$61,MATCH(ET.county!$B55,ET.region!$A$51:$A$61,0),MATCH(ET.county!G$1,ET.region!$A$51:$M$51,0))","v":6.2976377952755911},{"$f":"INDEX(ET.region!$A$51:$M$61,MATCH(ET.county!$B55,ET.region!$A$51:$A$61,0),MATCH(ET.county!H$1,ET.region!$A$51:$M$51,0))","v":6.6968503937007879},{"$f":"INDEX(ET.region!$A$51:$M$61,MATCH(ET.county!$B55,ET.region!$A$51:$A$61,0),MATCH(ET.county!I$1,ET.region!$A$51:$M$51,0))","v":6.8346456692913389},{"$f":"INDEX(ET.region!$A$51:$M$61,MATCH(ET.county!$B55,ET.region!$A$51:$A$61,0),MATCH(ET.county!J$1,ET.region!$A$51:$M$51,0))","v":6.1145669291338578},{"$f":"INDEX(ET.region!$A$51:$M$61,MATCH(ET.county!$B55,ET.region!$A$51:$A$61,0),MATCH(ET.county!K$1,ET.region!$A$51:$M$51,0))","v":4.7125984251968509},{"$f":"INDEX(ET.region!$A$51:$M$61,MATCH(ET.county!$B55,ET.region!$A$51:$A$61,0),MATCH(ET.county!L$1,ET.region!$A$51:$M$51,0))","v":3.4661417322834644},{"$f":"INDEX(ET.region!$A$51:$M$61,MATCH(ET.county!$B55,ET.region!$A$51:$A$61,0),MATCH(ET.county!M$1,ET.region!$A$51:$M$51,0))","v":2.1968503937007875},{"$f":"INDEX(ET.region!$A$51:$M$61,MATCH(ET.county!$B55,ET.region!$A$51:$A$61,0),MATCH(ET.county!N$1,ET.region!$A$51:$M$51,0))","v":1.55}]
["Lincoln ","Salisbury",{"$f":"INDEX(ET.region!$A$51:$M$61,MATCH(ET.county!$B56,ET.region!$A$51:$A$61,0),MATCH(ET.county!C$1,ET.region!$A$51:$M$51,0))","v":1.4889763779527558},{"$f":"INDEX(ET.region!$A$51:$M$61,MATCH(ET.county!$B56,ET.region!$A$51:$A$61,0),MATCH(ET.county!D$1,ET.region!$A$51:$M$51,0))","v":1.9401574803149606},{"$f":"INDEX(ET.region!$A$51:$M$61,MATCH(ET.county!$B56,ET.region!$A$51:$A$61,0),MATCH(ET.county!E$1,ET.region!$A$51:$M$51,0))","v":3.2952755905511819},{"$f":"INDEX(ET.region!$A$51:$M$61,MATCH(ET.county!$B56,ET.region!$A$51:$A$61,0),MATCH(ET.county!F$1,ET.region!$A$51:$M$51,0))","v":4.7007874015748037},{"$f":"INDEX(ET.region!$A$51:$M$61,MATCH(ET.county!$B56,ET.region!$A$51:$A$61,0),MATCH(ET.county!G$1,ET.region!$A$51:$M$51,0))","v":6.0169291338582678},{"$f":"INDEX(ET.region!$A$51:$M$61,MATCH(ET.county!$B56,ET.region!$A$51:$A$61,0),MATCH(ET.county!H$1,ET.region!$A$51:$M$51,0))","v":6.6496062992125982},{"$f":"INDEX(ET.region!$A$51:$M$61,MATCH(ET.county!$B56,ET.region!$A$51:$A$61,0),MATCH(ET.county!I$1,ET.region!$A$51:$M$51,0))","v":6.9322834645669289},{"$f":"INDEX(ET.region!$A$51:$M$61,MATCH(ET.county!$B56,ET.region!$A$51:$A$61,0),MATCH(ET.county!J$1,ET.region!$A$51:$M$51,0))","v":6.1755905511811022},{"$f":"INDEX(ET.region!$A$51:$M$61,MATCH(ET.county!$B56,ET.region!$A$51:$A$61,0),MATCH(ET.county!K$1,ET.region!$A$51:$M$51,0))","v":4.7125984251968509},{"$f":"INDEX(ET.region!$A$51:$M$61,MATCH(ET.county!$B56,ET.region!$A$51:$A$61,0),MATCH(ET.county!L$1,ET.region!$A$51:$M$51,0))","v":3.4173228346456694},{"$f":"INDEX(ET.region!$A$51:$M$61,MATCH(ET.county!$B56,ET.region!$A$51:$A$61,0),MATCH(ET.county!M$1,ET.region!$A$51:$M$51,0))","v":2.1141732283464569},{"$f":"INDEX(ET.region!$A$51:$M$61,MATCH(ET.county!$B56,ET.region!$A$51:$A$61,0),MATCH(ET.county!N$1,ET.region!$A$51:$M$51,0))","v":1.4523622047244096}]
["Macon ","Fletcher",{"$f":"INDEX(ET.region!$A$51:$M$61,MATCH(ET.county!$B57,ET.region!$A$51:$A$61,0),MATCH(ET.county!C$1,ET.region!$A$51:$M$51,0))","v":1.3913385826771654},{"$f":"INDEX(ET.region!$A$51:$M$61,MATCH(ET.county!$B57,ET.region!$A$51:$A$61,0),MATCH(ET.county!D$1,ET.region!$A$51:$M$51,0))","v":1.7748031496062995},{"$f":"INDEX(ET.region!$A$51:$M$61,MATCH(ET.county!$B57,ET.region!$A$51:$A$61,0),MATCH(ET.county!E$1,ET.region!$A$51:$M$51,0))","v":3.0633858267716536},{"$f":"INDEX(ET.region!$A$51:$M$61,MATCH(ET.county!$B57,ET.region!$A$51:$A$61,0),MATCH(ET.county!F$1,ET.region!$A$51:$M$51,0))","v":4.4173228346456694},{"$f":"INDEX(ET.region!$A$51:$M$61,MATCH(ET.county!$B57,ET.region!$A$51:$A$61,0),MATCH(ET.county!G$1,ET.region!$A$51:$M$51,0))","v":5.7362204724409454},{"$f":"INDEX(ET.region!$A$51:$M$61,MATCH(ET.county!$B57,ET.region!$A$51:$A$61,0),MATCH(ET.county!H$1,ET.region!$A$51:$M$51,0))","v":6.3070866141732287},{"$f":"INDEX(ET.region!$A$51:$M$61,MATCH(ET.county!$B57,ET.region!$A$51:$A$61,0),MATCH(ET.county!I$1,ET.region!$A$51:$M$51,0))","v":6.5417322834645679},{"$f":"INDEX(ET.region!$A$51:$M$61,MATCH(ET.county!$B57,ET.region!$A$51:$A$61,0),MATCH(ET.county!J$1,ET.region!$A$51:$M$51,0))","v":5.9314960629921272},{"$f":"INDEX(ET.region!$A$51:$M$61,MATCH(ET.county!$B57,ET.region!$A$51:$A$61,0),MATCH(ET.county!K$1,ET.region!$A$51:$M$51,0))","v":4.5118110236220472},{"$f":"INDEX(ET.region!$A$51:$M$61,MATCH(ET.county!$B57,ET.region!$A$51:$A$61,0),MATCH(ET.county!L$1,ET.region!$A$51:$M$51,0))","v":3.270866141732284},{"$f":"INDEX(ET.region!$A$51:$M$61,MATCH(ET.county!$B57,ET.region!$A$51:$A$61,0),MATCH(ET.county!M$1,ET.region!$A$51:$M$51,0))","v":1.9724409448818898},{"$f":"INDEX(ET.region!$A$51:$M$61,MATCH(ET.county!$B57,ET.region!$A$51:$A$61,0),MATCH(ET.county!N$1,ET.region!$A$51:$M$51,0))","v":1.3547244094488189}]
["Madison ","Fletcher",{"$f":"INDEX(ET.region!$A$51:$M$61,MATCH(ET.county!$B58,ET.region!$A$51:$A$61,0),MATCH(ET.county!C$1,ET.region!$A$51:$M$51,0))","v":1.3913385826771654},{"$f":"INDEX(ET.region!$A$51:$M$61,MATCH(ET.county!$B58,ET.region!$A$51:$A$61,0),MATCH(ET.county!D$1,ET.region!$A$51:$M$51,0))","v":1.7748031496062995},{"$f":"INDEX(ET.region!$A$51:$M$61,MATCH(ET.county!$B58,ET.region!$A$51:$A$61,0),MATCH(ET.county!E$1,ET.region!$A$51:$M$51,0))","v":3.0633858267716536},{"$f":"INDEX(ET.region!$A$51:$M$61,MATCH(ET.county!$B58,ET.region!$A$51:$A$61,0),MATCH(ET.county!F$1,ET.region!$A$51:$M$51,0))","v":4.4173228346456694},{"$f":"INDEX(ET.region!$A$51:$M$61,MATCH(ET.county!$B58,ET.region!$A$51:$A$61,0),MATCH(ET.county!G$1,ET.region!$A$51:$M$51,0))","v":5.7362204724409454},{"$f":"INDEX(ET.region!$A$51:$M$61,MATCH(ET.county!$B58,ET.region!$A$51:$A$61,0),MATCH(ET.county!H$1,ET.region!$A$51:$M$51,0))","v":6.3070866141732287},{"$f":"INDEX(ET.region!$A$51:$M$61,MATCH(ET.county!$B58,ET.region!$A$51:$A$61,0),MATCH(ET.county!I$1,ET.region!$A$51:$M$51,0))","v":6.5417322834645679},{"$f":"INDEX(ET.region!$A$51:$M$61,MATCH(ET.county!$B58,ET.region!$A$51:$A$61,0),MATCH(ET.county!J$1,ET.region!$A$51:$M$51,0))","v":5.9314960629921272},{"$f":"INDEX(ET.region!$A$51:$M$61,MATCH(ET.county!$B58,ET.region!$A$51:$A$61,0),MATCH(ET.county!K$1,ET.region!$A$51:$M$51,0))","v":4.5118110236220472},{"$f":"INDEX(ET.region!$A$51:$M$61,MATCH(ET.county!$B58,ET.region!$A$51:$A$61,0),MATCH(ET.county!L$1,ET.region!$A$51:$M$51,0))","v":3.270866141732284},{"$f":"INDEX(ET.region!$A$51:$M$61,MATCH(ET.county!$B58,ET.region!$A$51:$A$61,0),MATCH(ET.county!M$1,ET.region!$A$51:$M$51,0))","v":1.9724409448818898},{"$f":"INDEX(ET.region!$A$51:$M$61,MATCH(ET.county!$B58,ET.region!$A$51:$A$61,0),MATCH(ET.county!N$1,ET.region!$A$51:$M$51,0))","v":1.3547244094488189}]
["Martin ","Lewiston",{"$f":"INDEX(ET.region!$A$51:$M$61,MATCH(ET.county!$B59,ET.region!$A$51:$A$61,0),MATCH(ET.county!C$1,ET.region!$A$51:$M$51,0))","v":1.5255905511811025},{"$f":"INDEX(ET.region!$A$51:$M$61,MATCH(ET.county!$B59,ET.region!$A$51:$A$61,0),MATCH(ET.county!D$1,ET.region!$A$51:$M$51,0))","v":2.0173228346456695},{"$f":"INDEX(ET.region!$A$51:$M$61,MATCH(ET.county!$B59,ET.region!$A$51:$A$61,0),MATCH(ET.county!E$1,ET.region!$A$51:$M$51,0))","v":3.4905511811023624},{"$f":"INDEX(ET.region!$A$51:$M$61,MATCH(ET.county!$B59,ET.region!$A$51:$A$61,0),MATCH(ET.county!F$1,ET.region!$A$51:$M$51,0))","v":5.0551181102362204},{"$f":"INDEX(ET.region!$A$51:$M$61,MATCH(ET.county!$B59,ET.region!$A$51:$A$61,0),MATCH(ET.county!G$1,ET.region!$A$51:$M$51,0))","v":6.4318897637795267},{"$f":"INDEX(ET.region!$A$51:$M$61,MATCH(ET.county!$B59,ET.region!$A$51:$A$61,0),MATCH(ET.county!H$1,ET.region!$A$51:$M$51,0))","v":7.0748031496063},{"$f":"INDEX(ET.region!$A$51:$M$61,MATCH(ET.county!$B59,ET.region!$A$51:$A$61,0),MATCH(ET.county!I$1,ET.region!$A$51:$M$51,0))","v":7.359448818897639},{"$f":"INDEX(ET.region!$A$51:$M$61,MATCH(ET.county!$B59,ET.region!$A$51:$A$61,0),MATCH(ET.county!J$1,ET.region!$A$51:$M$51,0))","v":6.566141732283465},{"$f":"INDEX(ET.region!$A$51:$M$61,MATCH(ET.county!$B59,ET.region!$A$51:$A$61,0),MATCH(ET.county!K$1,ET.region!$A$51:$M$51,0))","v":4.9488188976377963},{"$f":"INDEX(ET.region!$A$51:$M$61,MATCH(ET.county!$B59,ET.region!$A$51:$A$61,0),MATCH(ET.county!L$1,ET.region!$A$51:$M$51,0))","v":3.5759842519685043},{"$f":"INDEX(ET.region!$A$51:$M$61,MATCH(ET.county!$B59,ET.region!$A$51:$A$61,0),MATCH(ET.county!M$1,ET.region!$A$51:$M$51,0))","v":2.1968503937007875},{"$f":"INDEX(ET.region!$A$51:$M$61,MATCH(ET.county!$B59,ET.region!$A$51:$A$61,0),MATCH(ET.county!N$1,ET.region!$A$51:$M$51,0))","v":1.5255905511811025}]
["Mcdowell ","Lenoir",{"$f":"INDEX(ET.region!$A$51:$M$61,MATCH(ET.county!$B60,ET.region!$A$51:$A$61,0),MATCH(ET.county!C$1,ET.region!$A$51:$M$51,0))","v":1.4523622047244096},{"$f":"INDEX(ET.region!$A$51:$M$61,MATCH(ET.county!$B60,ET.region!$A$51:$A$61,0),MATCH(ET.county!D$1,ET.region!$A$51:$M$51,0))","v":1.8850393700787402},{"$f":"INDEX(ET.region!$A$51:$M$61,MATCH(ET.county!$B60,ET.region!$A$51:$A$61,0),MATCH(ET.county!E$1,ET.region!$A$51:$M$51,0))","v":3.1610236220472441},{"$f":"INDEX(ET.region!$A$51:$M$61,MATCH(ET.county!$B60,ET.region!$A$51:$A$61,0),MATCH(ET.county!F$1,ET.region!$A$51:$M$51,0))","v":4.346456692913387},{"$f":"INDEX(ET.region!$A$51:$M$61,MATCH(ET.county!$B60,ET.region!$A$51:$A$61,0),MATCH(ET.county!G$1,ET.region!$A$51:$M$51,0))","v":5.333464566929135},{"$f":"INDEX(ET.region!$A$51:$M$61,MATCH(ET.county!$B60,ET.region!$A$51:$A$61,0),MATCH(ET.county!H$1,ET.region!$A$51:$M$51,0))","v":5.5748031496062991},{"$f":"INDEX(ET.region!$A$51:$M$61,MATCH(ET.county!$B60,ET.region!$A$51:$A$61,0),MATCH(ET.county!I$1,ET.region!$A$51:$M$51,0))","v":5.6751968503937018},{"$f":"INDEX(ET.region!$A$51:$M$61,MATCH(ET.county!$B60,ET.region!$A$51:$A$61,0),MATCH(ET.county!J$1,ET.region!$A$51:$M$51,0))","v":5.0893700787401581},{"$f":"INDEX(ET.region!$A$51:$M$61,MATCH(ET.county!$B60,ET.region!$A$51:$A$61,0),MATCH(ET.county!K$1,ET.region!$A$51:$M$51,0))","v":4.015748031496063},{"$f":"INDEX(ET.region!$A$51:$M$61,MATCH(ET.county!$B60,ET.region!$A$51:$A$61,0),MATCH(ET.county!L$1,ET.region!$A$51:$M$51,0))","v":3.0633858267716536},{"$f":"INDEX(ET.region!$A$51:$M$61,MATCH(ET.county!$B60,ET.region!$A$51:$A$61,0),MATCH(ET.county!M$1,ET.region!$A$51:$M$51,0))","v":1.9606299212598426},{"$f":"INDEX(ET.region!$A$51:$M$61,MATCH(ET.county!$B60,ET.region!$A$51:$A$61,0),MATCH(ET.county!N$1,ET.region!$A$51:$M$51,0))","v":1.3913385826771654}]
["Mecklenburg","Salisbury",{"$f":"INDEX(ET.region!$A$51:$M$61,MATCH(ET.county!$B61,ET.region!$A$51:$A$61,0),MATCH(ET.county!C$1,ET.region!$A$51:$M$51,0))","v":1.4889763779527558},{"$f":"INDEX(ET.region!$A$51:$M$61,MATCH(ET.county!$B61,ET.region!$A$51:$A$61,0),MATCH(ET.county!D$1,ET.region!$A$51:$M$51,0))","v":1.9401574803149606},{"$f":"INDEX(ET.region!$A$51:$M$61,MATCH(ET.county!$B61,ET.region!$A$51:$A$61,0),MATCH(ET.county!E$1,ET.region!$A$51:$M$51,0))","v":3.2952755905511819},{"$f":"INDEX(ET.region!$A$51:$M$61,MATCH(ET.county!$B61,ET.region!$A$51:$A$61,0),MATCH(ET.county!F$1,ET.region!$A$51:$M$51,0))","v":4.7007874015748037},{"$f":"INDEX(ET.region!$A$51:$M$61,MATCH(ET.county!$B61,ET.region!$A$51:$A$61,0),MATCH(ET.county!G$1,ET.region!$A$51:$M$51,0))","v":6.0169291338582678},{"$f":"INDEX(ET.region!$A$51:$M$61,MATCH(ET.county!$B61,ET.region!$A$51:$A$61,0),MATCH(ET.county!H$1,ET.region!$A$51:$M$51,0))","v":6.6496062992125982},{"$f":"INDEX(ET.region!$A$51:$M$61,MATCH(ET.county!$B61,ET.region!$A$51:$A$61,0),MATCH(ET.county!I$1,ET.region!$A$51:$M$51,0))","v":6.9322834645669289},{"$f":"INDEX(ET.region!$A$51:$M$61,MATCH(ET.county!$B61,ET.region!$A$51:$A$61,0),MATCH(ET.county!J$1,ET.region!$A$51:$M$51,0))","v":6.1755905511811022},{"$f":"INDEX(ET.region!$A$51:$M$61,MATCH(ET.county!$B61,ET.region!$A$51:$A$61,0),MATCH(ET.county!K$1,ET.region!$A$51:$M$51,0))","v":4.7125984251968509},{"$f":"INDEX(ET.region!$A$51:$M$61,MATCH(ET.county!$B61,ET.region!$A$51:$A$61,0),MATCH(ET.county!L$1,ET.region!$A$51:$M$51,0))","v":3.4173228346456694},{"$f":"INDEX(ET.region!$A$51:$M$61,MATCH(ET.county!$B61,ET.region!$A$51:$A$61,0),MATCH(ET.county!M$1,ET.region!$A$51:$M$51,0))","v":2.1141732283464569},{"$f":"INDEX(ET.region!$A$51:$M$61,MATCH(ET.county!$B61,ET.region!$A$51:$A$61,0),MATCH(ET.county!N$1,ET.region!$A$51:$M$51,0))","v":1.4523622047244096}]
["Mitchell","Fletcher",{"$f":"INDEX(ET.region!$A$51:$M$61,MATCH(ET.county!$B62,ET.region!$A$51:$A$61,0),MATCH(ET.county!C$1,ET.region!$A$51:$M$51,0))","v":1.3913385826771654},{"$f":"INDEX(ET.region!$A$51:$M$61,MATCH(ET.county!$B62,ET.region!$A$51:$A$61,0),MATCH(ET.county!D$1,ET.region!$A$51:$M$51,0))","v":1.7748031496062995},{"$f":"INDEX(ET.region!$A$51:$M$61,MATCH(ET.county!$B62,ET.region!$A$51:$A$61,0),MATCH(ET.county!E$1,ET.region!$A$51:$M$51,0))","v":3.0633858267716536},{"$f":"INDEX(ET.region!$A$51:$M$61,MATCH(ET.county!$B62,ET.region!$A$51:$A$61,0),MATCH(ET.county!F$1,ET.region!$A$51:$M$51,0))","v":4.4173228346456694},{"$f":"INDEX(ET.region!$A$51:$M$61,MATCH(ET.county!$B62,ET.region!$A$51:$A$61,0),MATCH(ET.county!G$1,ET.region!$A$51:$M$51,0))","v":5.7362204724409454},{"$f":"INDEX(ET.region!$A$51:$M$61,MATCH(ET.county!$B62,ET.region!$A$51:$A$61,0),MATCH(ET.county!H$1,ET.region!$A$51:$M$51,0))","v":6.3070866141732287},{"$f":"INDEX(ET.region!$A$51:$M$61,MATCH(ET.county!$B62,ET.region!$A$51:$A$61,0),MATCH(ET.county!I$1,ET.region!$A$51:$M$51,0))","v":6.5417322834645679},{"$f":"INDEX(ET.region!$A$51:$M$61,MATCH(ET.county!$B62,ET.region!$A$51:$A$61,0),MATCH(ET.county!J$1,ET.region!$A$51:$M$51,0))","v":5.9314960629921272},{"$f":"INDEX(ET.region!$A$51:$M$61,MATCH(ET.county!$B62,ET.region!$A$51:$A$61,0),MATCH(ET.county!K$1,ET.region!$A$51:$M$51,0))","v":4.5118110236220472},{"$f":"INDEX(ET.region!$A$51:$M$61,MATCH(ET.county!$B62,ET.region!$A$51:$A$61,0),MATCH(ET.county!L$1,ET.region!$A$51:$M$51,0))","v":3.270866141732284},{"$f":"INDEX(ET.region!$A$51:$M$61,MATCH(ET.county!$B62,ET.region!$A$51:$A$61,0),MATCH(ET.county!M$1,ET.region!$A$51:$M$51,0))","v":1.9724409448818898},{"$f":"INDEX(ET.region!$A$51:$M$61,MATCH(ET.county!$B62,ET.region!$A$51:$A$61,0),MATCH(ET.county!N$1,ET.region!$A$51:$M$51,0))","v":1.3547244094488189}]
["Montgomery ","Jackson.Springs",{"$f":"INDEX(ET.region!$A$51:$M$61,MATCH(ET.county!$B63,ET.region!$A$51:$A$61,0),MATCH(ET.county!C$1,ET.region!$A$51:$M$51,0))","v":1.5011811023622048},{"$f":"INDEX(ET.region!$A$51:$M$61,MATCH(ET.county!$B63,ET.region!$A$51:$A$61,0),MATCH(ET.county!D$1,ET.region!$A$51:$M$51,0))","v":1.9622047244094489},{"$f":"INDEX(ET.region!$A$51:$M$61,MATCH(ET.county!$B63,ET.region!$A$51:$A$61,0),MATCH(ET.county!E$1,ET.region!$A$51:$M$51,0))","v":3.4051181102362205},{"$f":"INDEX(ET.region!$A$51:$M$61,MATCH(ET.county!$B63,ET.region!$A$51:$A$61,0),MATCH(ET.county!F$1,ET.region!$A$51:$M$51,0))","v":4.8661417322834648},{"$f":"INDEX(ET.region!$A$51:$M$61,MATCH(ET.county!$B63,ET.region!$A$51:$A$61,0),MATCH(ET.county!G$1,ET.region!$A$51:$M$51,0))","v":6.1755905511811022},{"$f":"INDEX(ET.region!$A$51:$M$61,MATCH(ET.county!$B63,ET.region!$A$51:$A$61,0),MATCH(ET.county!H$1,ET.region!$A$51:$M$51,0))","v":6.7440944881889759},{"$f":"INDEX(ET.region!$A$51:$M$61,MATCH(ET.county!$B63,ET.region!$A$51:$A$61,0),MATCH(ET.county!I$1,ET.region!$A$51:$M$51,0))","v":7.0055118110236227},{"$f":"INDEX(ET.region!$A$51:$M$61,MATCH(ET.county!$B63,ET.region!$A$51:$A$61,0),MATCH(ET.county!J$1,ET.region!$A$51:$M$51,0))","v":6.2244094488188981},{"$f":"INDEX(ET.region!$A$51:$M$61,MATCH(ET.county!$B63,ET.region!$A$51:$A$61,0),MATCH(ET.county!K$1,ET.region!$A$51:$M$51,0))","v":4.771653543307087},{"$f":"INDEX(ET.region!$A$51:$M$61,MATCH(ET.county!$B63,ET.region!$A$51:$A$61,0),MATCH(ET.county!L$1,ET.region!$A$51:$M$51,0))","v":3.4051181102362205},{"$f":"INDEX(ET.region!$A$51:$M$61,MATCH(ET.county!$B63,ET.region!$A$51:$A$61,0),MATCH(ET.county!M$1,ET.region!$A$51:$M$51,0))","v":2.0905511811023625},{"$f":"INDEX(ET.region!$A$51:$M$61,MATCH(ET.county!$B63,ET.region!$A$51:$A$61,0),MATCH(ET.county!N$1,ET.region!$A$51:$M$51,0))","v":1.4889763779527558}]
["Moore ","Jackson.Springs",{"$f":"INDEX(ET.region!$A$51:$M$61,MATCH(ET.county!$B64,ET.region!$A$51:$A$61,0),MATCH(ET.county!C$1,ET.region!$A$51:$M$51,0))","v":1.5011811023622048},{"$f":"INDEX(ET.region!$A$51:$M$61,MATCH(ET.county!$B64,ET.region!$A$51:$A$61,0),MATCH(ET.county!D$1,ET.region!$A$51:$M$51,0))","v":1.9622047244094489},{"$f":"INDEX(ET.region!$A$51:$M$61,MATCH(ET.county!$B64,ET.region!$A$51:$A$61,0),MATCH(ET.county!E$1,ET.region!$A$51:$M$51,0))","v":3.4051181102362205},{"$f":"INDEX(ET.region!$A$51:$M$61,MATCH(ET.county!$B64,ET.region!$A$51:$A$61,0),MATCH(ET.county!F$1,ET.region!$A$51:$M$51,0))","v":4.8661417322834648},{"$f":"INDEX(ET.region!$A$51:$M$61,MATCH(ET.county!$B64,ET.region!$A$51:$A$61,0),MATCH(ET.county!G$1,ET.region!$A$51:$M$51,0))","v":6.1755905511811022},{"$f":"INDEX(ET.region!$A$51:$M$61,MATCH(ET.county!$B64,ET.region!$A$51:$A$61,0),MATCH(ET.county!H$1,ET.region!$A$51:$M$51,0))","v":6.7440944881889759},{"$f":"INDEX(ET.region!$A$51:$M$61,MATCH(ET.county!$B64,ET.region!$A$51:$A$61,0),MATCH(ET.county!I$1,ET.region!$A$51:$M$51,0))","v":7.0055118110236227},{"$f":"INDEX(ET.region!$A$51:$M$61,MATCH(ET.county!$B64,ET.region!$A$51:$A$61,0),MATCH(ET.county!J$1,ET.region!$A$51:$M$51,0))","v":6.2244094488188981},{"$f":"INDEX(ET.region!$A$51:$M$61,MATCH(ET.county!$B64,ET.region!$A$51:$A$61,0),MATCH(ET.county!K$1,ET.region!$A$51:$M$51,0))","v":4.771653543307087},{"$f":"INDEX(ET.region!$A$51:$M$61,MATCH(ET.county!$B64,ET.region!$A$51:$A$61,0),MATCH(ET.county!L$1,ET.region!$A$51:$M$51,0))","v":3.4051181102362205},{"$f":"INDEX(ET.region!$A$51:$M$61,MATCH(ET.county!$B64,ET.region!$A$51:$A$61,0),MATCH(ET.county!M$1,ET.region!$A$51:$M$51,0))","v":2.0905511811023625},{"$f":"INDEX(ET.region!$A$51:$M$61,MATCH(ET.county!$B64,ET.region!$A$51:$A$61,0),MATCH(ET.county!N$1,ET.region!$A$51:$M$51,0))","v":1.4889763779527558}]
["Nash ","Raleigh",{"$f":"INDEX(ET.region!$A$51:$M$61,MATCH(ET.county!$B65,ET.region!$A$51:$A$61,0),MATCH(ET.county!C$1,ET.region!$A$51:$M$51,0))","v":1.562204724409449},{"$f":"INDEX(ET.region!$A$51:$M$61,MATCH(ET.county!$B65,ET.region!$A$51:$A$61,0),MATCH(ET.county!D$1,ET.region!$A$51:$M$51,0))","v":2.0503937007874016},{"$f":"INDEX(ET.region!$A$51:$M$61,MATCH(ET.county!$B65,ET.region!$A$51:$A$61,0),MATCH(ET.county!E$1,ET.region!$A$51:$M$51,0))","v":3.5027559055118114},{"$f":"INDEX(ET.region!$A$51:$M$61,MATCH(ET.county!$B65,ET.region!$A$51:$A$61,0),MATCH(ET.county!F$1,ET.region!$A$51:$M$51,0))","v":4.9370078740157481},{"$f":"INDEX(ET.region!$A$51:$M$61,MATCH(ET.county!$B65,ET.region!$A$51:$A$61,0),MATCH(ET.county!G$1,ET.region!$A$51:$M$51,0))","v":6.2122047244094487},{"$f":"INDEX(ET.region!$A$51:$M$61,MATCH(ET.county!$B65,ET.region!$A$51:$A$61,0),MATCH(ET.county!H$1,ET.region!$A$51:$M$51,0))","v":6.6968503937007879},{"$f":"INDEX(ET.region!$A$51:$M$61,MATCH(ET.county!$B65,ET.region!$A$51:$A$61,0),MATCH(ET.county!I$1,ET.region!$A$51:$M$51,0))","v":6.9444881889763792},{"$f":"INDEX(ET.region!$A$51:$M$61,MATCH(ET.county!$B65,ET.region!$A$51:$A$61,0),MATCH(ET.county!J$1,ET.region!$A$51:$M$51,0))","v":6.2122047244094487},{"$f":"INDEX(ET.region!$A$51:$M$61,MATCH(ET.county!$B65,ET.region!$A$51:$A$61,0),MATCH(ET.county!K$1,ET.region!$A$51:$M$51,0))","v":4.7598425196850407},{"$f":"INDEX(ET.region!$A$51:$M$61,MATCH(ET.county!$B65,ET.region!$A$51:$A$61,0),MATCH(ET.county!L$1,ET.region!$A$51:$M$51,0))","v":3.4417322834645669},{"$f":"INDEX(ET.region!$A$51:$M$61,MATCH(ET.county!$B65,ET.region!$A$51:$A$61,0),MATCH(ET.county!M$1,ET.region!$A$51:$M$51,0))","v":2.1496062992125986},{"$f":"INDEX(ET.region!$A$51:$M$61,MATCH(ET.county!$B65,ET.region!$A$51:$A$61,0),MATCH(ET.county!N$1,ET.region!$A$51:$M$51,0))","v":1.5133858267716536}]
["New Hanover ","Whiteville",{"$f":"INDEX(ET.region!$A$51:$M$61,MATCH(ET.county!$B66,ET.region!$A$51:$A$61,0),MATCH(ET.county!C$1,ET.region!$A$51:$M$51,0))","v":1.6964566929133857},{"$f":"INDEX(ET.region!$A$51:$M$61,MATCH(ET.county!$B66,ET.region!$A$51:$A$61,0),MATCH(ET.county!D$1,ET.region!$A$51:$M$51,0))","v":2.1496062992125986},{"$f":"INDEX(ET.region!$A$51:$M$61,MATCH(ET.county!$B66,ET.region!$A$51:$A$61,0),MATCH(ET.county!E$1,ET.region!$A$51:$M$51,0))","v":3.6248031496062993},{"$f":"INDEX(ET.region!$A$51:$M$61,MATCH(ET.county!$B66,ET.region!$A$51:$A$61,0),MATCH(ET.county!F$1,ET.region!$A$51:$M$51,0))","v":4.9724409448818898},{"$f":"INDEX(ET.region!$A$51:$M$61,MATCH(ET.county!$B66,ET.region!$A$51:$A$61,0),MATCH(ET.county!G$1,ET.region!$A$51:$M$51,0))","v":6.2976377952755911},{"$f":"INDEX(ET.region!$A$51:$M$61,MATCH(ET.county!$B66,ET.region!$A$51:$A$61,0),MATCH(ET.county!H$1,ET.region!$A$51:$M$51,0))","v":6.6141732283464565},{"$f":"INDEX(ET.region!$A$51:$M$61,MATCH(ET.county!$B66,ET.region!$A$51:$A$61,0),MATCH(ET.county!I$1,ET.region!$A$51:$M$51,0))","v":6.8590551181102368},{"$f":"INDEX(ET.region!$A$51:$M$61,MATCH(ET.county!$B66,ET.region!$A$51:$A$61,0),MATCH(ET.county!J$1,ET.region!$A$51:$M$51,0))","v":6.1755905511811022},{"$f":"INDEX(ET.region!$A$51:$M$61,MATCH(ET.county!$B66,ET.region!$A$51:$A$61,0),MATCH(ET.county!K$1,ET.region!$A$51:$M$51,0))","v":4.8661417322834648},{"$f":"INDEX(ET.region!$A$51:$M$61,MATCH(ET.county!$B66,ET.region!$A$51:$A$61,0),MATCH(ET.county!L$1,ET.region!$A$51:$M$51,0))","v":3.6370078740157483},{"$f":"INDEX(ET.region!$A$51:$M$61,MATCH(ET.county!$B66,ET.region!$A$51:$A$61,0),MATCH(ET.county!M$1,ET.region!$A$51:$M$51,0))","v":2.3622047244094486},{"$f":"INDEX(ET.region!$A$51:$M$61,MATCH(ET.county!$B66,ET.region!$A$51:$A$61,0),MATCH(ET.county!N$1,ET.region!$A$51:$M$51,0))","v":1.684251968503937}]
["Northampton ","Lewiston",{"$f":"INDEX(ET.region!$A$51:$M$61,MATCH(ET.county!$B67,ET.region!$A$51:$A$61,0),MATCH(ET.county!C$1,ET.region!$A$51:$M$51,0))","v":1.5255905511811025},{"$f":"INDEX(ET.region!$A$51:$M$61,MATCH(ET.county!$B67,ET.region!$A$51:$A$61,0),MATCH(ET.county!D$1,ET.region!$A$51:$M$51,0))","v":2.0173228346456695},{"$f":"INDEX(ET.region!$A$51:$M$61,MATCH(ET.county!$B67,ET.region!$A$51:$A$61,0),MATCH(ET.county!E$1,ET.region!$A$51:$M$51,0))","v":3.4905511811023624},{"$f":"INDEX(ET.region!$A$51:$M$61,MATCH(ET.county!$B67,ET.region!$A$51:$A$61,0),MATCH(ET.county!F$1,ET.region!$A$51:$M$51,0))","v":5.0551181102362204},{"$f":"INDEX(ET.region!$A$51:$M$61,MATCH(ET.county!$B67,ET.region!$A$51:$A$61,0),MATCH(ET.county!G$1,ET.region!$A$51:$M$51,0))","v":6.4318897637795267},{"$f":"INDEX(ET.region!$A$51:$M$61,MATCH(ET.county!$B67,ET.region!$A$51:$A$61,0),MATCH(ET.county!H$1,ET.region!$A$51:$M$51,0))","v":7.0748031496063},{"$f":"INDEX(ET.region!$A$51:$M$61,MATCH(ET.county!$B67,ET.region!$A$51:$A$61,0),MATCH(ET.county!I$1,ET.region!$A$51:$M$51,0))","v":7.359448818897639},{"$f":"INDEX(ET.region!$A$51:$M$61,MATCH(ET.county!$B67,ET.region!$A$51:$A$61,0),MATCH(ET.county!J$1,ET.region!$A$51:$M$51,0))","v":6.566141732283465},{"$f":"INDEX(ET.region!$A$51:$M$61,MATCH(ET.county!$B67,ET.region!$A$51:$A$61,0),MATCH(ET.county!K$1,ET.region!$A$51:$M$51,0))","v":4.9488188976377963},{"$f":"INDEX(ET.region!$A$51:$M$61,MATCH(ET.county!$B67,ET.region!$A$51:$A$61,0),MATCH(ET.county!L$1,ET.region!$A$51:$M$51,0))","v":3.5759842519685043},{"$f":"INDEX(ET.region!$A$51:$M$61,MATCH(ET.county!$B67,ET.region!$A$51:$A$61,0),MATCH(ET.county!M$1,ET.region!$A$51:$M$51,0))","v":2.1968503937007875},{"$f":"INDEX(ET.region!$A$51:$M$61,MATCH(ET.county!$B67,ET.region!$A$51:$A$61,0),MATCH(ET.county!N$1,ET.region!$A$51:$M$51,0))","v":1.5255905511811025}]
["Onslow ","Aurora",{"$f":"INDEX(ET.region!$A$51:$M$61,MATCH(ET.county!$B68,ET.region!$A$51:$A$61,0),MATCH(ET.county!C$1,ET.region!$A$51:$M$51,0))","v":1.581},{"$f":"INDEX(ET.region!$A$51:$M$61,MATCH(ET.county!$B68,ET.region!$A$51:$A$61,0),MATCH(ET.county!D$1,ET.region!$A$51:$M$51,0))","v":1.9600000000000002},{"$f":"INDEX(ET.region!$A$51:$M$61,MATCH(ET.county!$B68,ET.region!$A$51:$A$61,0),MATCH(ET.county!E$1,ET.region!$A$51:$M$51,0))","v":3.2549999999999999},{"$f":"INDEX(ET.region!$A$51:$M$61,MATCH(ET.county!$B68,ET.region!$A$51:$A$61,0),MATCH(ET.county!F$1,ET.region!$A$51:$M$51,0))","v":4.59},{"$f":"INDEX(ET.region!$A$51:$M$61,MATCH(ET.county!$B68,ET.region!$A$51:$A$61,0),MATCH(ET.county!G$1,ET.region!$A$51:$M$51,0))","v":5.7969999999999997},{"$f":"INDEX(ET.region!$A$51:$M$61,MATCH(ET.county!$B68,ET.region!$A$51:$A$61,0),MATCH(ET.county!H$1,ET.region!$A$51:$M$51,0))","v":6.2399999999999993},{"$f":"INDEX(ET.region!$A$51:$M$61,MATCH(ET.county!$B68,ET.region!$A$51:$A$61,0),MATCH(ET.county!I$1,ET.region!$A$51:$M$51,0))","v":6.4790000000000001},{"$f":"INDEX(ET.region!$A$51:$M$61,MATCH(ET.county!$B68,ET.region!$A$51:$A$61,0),MATCH(ET.county!J$1,ET.region!$A$51:$M$51,0))","v":5.7350000000000003},{"$f":"INDEX(ET.region!$A$51:$M$61,MATCH(ET.county!$B68,ET.region!$A$51:$A$61,0),MATCH(ET.county!K$1,ET.region!$A$51:$M$51,0))","v":4.38},{"$f":"INDEX(ET.region!$A$51:$M$61,MATCH(ET.county!$B68,ET.region!$A$51:$A$61,0),MATCH(ET.county!L$1,ET.region!$A$51:$M$51,0))","v":3.2549999999999999},{"$f":"INDEX(ET.region!$A$51:$M$61,MATCH(ET.county!$B68,ET.region!$A$51:$A$61,0),MATCH(ET.county!M$1,ET.region!$A$51:$M$51,0))","v":2.0700000000000003},{"$f":"INDEX(ET.region!$A$51:$M$61,MATCH(ET.county!$B68,ET.region!$A$51:$A$61,0),MATCH(ET.county!N$1,ET.region!$A$51:$M$51,0))","v":1.55}]
["Orange ","Raleigh",{"$f":"INDEX(ET.region!$A$51:$M$61,MATCH(ET.county!$B69,ET.region!$A$51:$A$61,0),MATCH(ET.county!C$1,ET.region!$A$51:$M$51,0))","v":1.562204724409449},{"$f":"INDEX(ET.region!$A$51:$M$61,MATCH(ET.county!$B69,ET.region!$A$51:$A$61,0),MATCH(ET.county!D$1,ET.region!$A$51:$M$51,0))","v":2.0503937007874016},{"$f":"INDEX(ET.region!$A$51:$M$61,MATCH(ET.county!$B69,ET.region!$A$51:$A$61,0),MATCH(ET.county!E$1,ET.region!$A$51:$M$51,0))","v":3.5027559055118114},{"$f":"INDEX(ET.region!$A$51:$M$61,MATCH(ET.county!$B69,ET.region!$A$51:$A$61,0),MATCH(ET.county!F$1,ET.region!$A$51:$M$51,0))","v":4.9370078740157481},{"$f":"INDEX(ET.region!$A$51:$M$61,MATCH(ET.county!$B69,ET.region!$A$51:$A$61,0),MATCH(ET.county!G$1,ET.region!$A$51:$M$51,0))","v":6.2122047244094487},{"$f":"INDEX(ET.region!$A$51:$M$61,MATCH(ET.county!$B69,ET.region!$A$51:$A$61,0),MATCH(ET.county!H$1,ET.region!$A$51:$M$51,0))","v":6.6968503937007879},{"$f":"INDEX(ET.region!$A$51:$M$61,MATCH(ET.county!$B69,ET.region!$A$51:$A$61,0),MATCH(ET.county!I$1,ET.region!$A$51:$M$51,0))","v":6.9444881889763792},{"$f":"INDEX(ET.region!$A$51:$M$61,MATCH(ET.county!$B69,ET.region!$A$51:$A$61,0),MATCH(ET.county!J$1,ET.region!$A$51:$M$51,0))","v":6.2122047244094487},{"$f":"INDEX(ET.region!$A$51:$M$61,MATCH(ET.county!$B69,ET.region!$A$51:$A$61,0),MATCH(ET.county!K$1,ET.region!$A$51:$M$51,0))","v":4.7598425196850407},{"$f":"INDEX(ET.region!$A$51:$M$61,MATCH(ET.county!$B69,ET.region!$A$51:$A$61,0),MATCH(ET.county!L$1,ET.region!$A$51:$M$51,0))","v":3.4417322834645669},{"$f":"INDEX(ET.region!$A$51:$M$61,MATCH(ET.county!$B69,ET.region!$A$51:$A$61,0),MATCH(ET.county!M$1,ET.region!$A$51:$M$51,0))","v":2.1496062992125986},{"$f":"INDEX(ET.region!$A$51:$M$61,MATCH(ET.county!$B69,ET.region!$A$51:$A$61,0),MATCH(ET.county!N$1,ET.region!$A$51:$M$51,0))","v":1.5133858267716536}]
["Pamlico ","Aurora",{"$f":"INDEX(ET.region!$A$51:$M$61,MATCH(ET.county!$B70,ET.region!$A$51:$A$61,0),MATCH(ET.county!C$1,ET.region!$A$51:$M$51,0))","v":1.581},{"$f":"INDEX(ET.region!$A$51:$M$61,MATCH(ET.county!$B70,ET.region!$A$51:$A$61,0),MATCH(ET.county!D$1,ET.region!$A$51:$M$51,0))","v":1.9600000000000002},{"$f":"INDEX(ET.region!$A$51:$M$61,MATCH(ET.county!$B70,ET.region!$A$51:$A$61,0),MATCH(ET.county!E$1,ET.region!$A$51:$M$51,0))","v":3.2549999999999999},{"$f":"INDEX(ET.region!$A$51:$M$61,MATCH(ET.county!$B70,ET.region!$A$51:$A$61,0),MATCH(ET.county!F$1,ET.region!$A$51:$M$51,0))","v":4.59},{"$f":"INDEX(ET.region!$A$51:$M$61,MATCH(ET.county!$B70,ET.region!$A$51:$A$61,0),MATCH(ET.county!G$1,ET.region!$A$51:$M$51,0))","v":5.7969999999999997},{"$f":"INDEX(ET.region!$A$51:$M$61,MATCH(ET.county!$B70,ET.region!$A$51:$A$61,0),MATCH(ET.county!H$1,ET.region!$A$51:$M$51,0))","v":6.2399999999999993},{"$f":"INDEX(ET.region!$A$51:$M$61,MATCH(ET.county!$B70,ET.region!$A$51:$A$61,0),MATCH(ET.county!I$1,ET.region!$A$51:$M$51,0))","v":6.4790000000000001},{"$f":"INDEX(ET.region!$A$51:$M$61,MATCH(ET.county!$B70,ET.region!$A$51:$A$61,0),MATCH(ET.county!J$1,ET.region!$A$51:$M$51,0))","v":5.7350000000000003},{"$f":"INDEX(ET.region!$A$51:$M$61,MATCH(ET.county!$B70,ET.region!$A$51:$A$61,0),MATCH(ET.county!K$1,ET.region!$A$51:$M$51,0))","v":4.38},{"$f":"INDEX(ET.region!$A$51:$M$61,MATCH(ET.county!$B70,ET.region!$A$51:$A$61,0),MATCH(ET.county!L$1,ET.region!$A$51:$M$51,0))","v":3.2549999999999999},{"$f":"INDEX(ET.region!$A$51:$M$61,MATCH(ET.county!$B70,ET.region!$A$51:$A$61,0),MATCH(ET.county!M$1,ET.region!$A$51:$M$51,0))","v":2.0700000000000003},{"$f":"INDEX(ET.region!$A$51:$M$61,MATCH(ET.county!$B70,ET.region!$A$51:$A$61,0),MATCH(ET.county!N$1,ET.region!$A$51:$M$51,0))","v":1.55}]
["Pasquotank ","Lewiston",{"$f":"INDEX(ET.region!$A$51:$M$61,MATCH(ET.county!$B71,ET.region!$A$51:$A$61,0),MATCH(ET.county!C$1,ET.region!$A$51:$M$51,0))","v":1.5255905511811025},{"$f":"INDEX(ET.region!$A$51:$M$61,MATCH(ET.county!$B71,ET.region!$A$51:$A$61,0),MATCH(ET.county!D$1,ET.region!$A$51:$M$51,0))","v":2.0173228346456695},{"$f":"INDEX(ET.region!$A$51:$M$61,MATCH(ET.county!$B71,ET.region!$A$51:$A$61,0),MATCH(ET.county!E$1,ET.region!$A$51:$M$51,0))","v":3.4905511811023624},{"$f":"INDEX(ET.region!$A$51:$M$61,MATCH(ET.county!$B71,ET.region!$A$51:$A$61,0),MATCH(ET.county!F$1,ET.region!$A$51:$M$51,0))","v":5.0551181102362204},{"$f":"INDEX(ET.region!$A$51:$M$61,MATCH(ET.county!$B71,ET.region!$A$51:$A$61,0),MATCH(ET.county!G$1,ET.region!$A$51:$M$51,0))","v":6.4318897637795267},{"$f":"INDEX(ET.region!$A$51:$M$61,MATCH(ET.county!$B71,ET.region!$A$51:$A$61,0),MATCH(ET.county!H$1,ET.region!$A$51:$M$51,0))","v":7.0748031496063},{"$f":"INDEX(ET.region!$A$51:$M$61,MATCH(ET.county!$B71,ET.region!$A$51:$A$61,0),MATCH(ET.county!I$1,ET.region!$A$51:$M$51,0))","v":7.359448818897639},{"$f":"INDEX(ET.region!$A$51:$M$61,MATCH(ET.county!$B71,ET.region!$A$51:$A$61,0),MATCH(ET.county!J$1,ET.region!$A$51:$M$51,0))","v":6.566141732283465},{"$f":"INDEX(ET.region!$A$51:$M$61,MATCH(ET.county!$B71,ET.region!$A$51:$A$61,0),MATCH(ET.county!K$1,ET.region!$A$51:$M$51,0))","v":4.9488188976377963},{"$f":"INDEX(ET.region!$A$51:$M$61,MATCH(ET.county!$B71,ET.region!$A$51:$A$61,0),MATCH(ET.county!L$1,ET.region!$A$51:$M$51,0))","v":3.5759842519685043},{"$f":"INDEX(ET.region!$A$51:$M$61,MATCH(ET.county!$B71,ET.region!$A$51:$A$61,0),MATCH(ET.county!M$1,ET.region!$A$51:$M$51,0))","v":2.1968503937007875},{"$f":"INDEX(ET.region!$A$51:$M$61,MATCH(ET.county!$B71,ET.region!$A$51:$A$61,0),MATCH(ET.county!N$1,ET.region!$A$51:$M$51,0))","v":1.5255905511811025}]
["Pender ","Whiteville",{"$f":"INDEX(ET.region!$A$51:$M$61,MATCH(ET.county!$B72,ET.region!$A$51:$A$61,0),MATCH(ET.county!C$1,ET.region!$A$51:$M$51,0))","v":1.6964566929133857},{"$f":"INDEX(ET.region!$A$51:$M$61,MATCH(ET.county!$B72,ET.region!$A$51:$A$61,0),MATCH(ET.county!D$1,ET.region!$A$51:$M$51,0))","v":2.1496062992125986},{"$f":"INDEX(ET.region!$A$51:$M$61,MATCH(ET.county!$B72,ET.region!$A$51:$A$61,0),MATCH(ET.county!E$1,ET.region!$A$51:$M$51,0))","v":3.6248031496062993},{"$f":"INDEX(ET.region!$A$51:$M$61,MATCH(ET.county!$B72,ET.region!$A$51:$A$61,0),MATCH(ET.county!F$1,ET.region!$A$51:$M$51,0))","v":4.9724409448818898},{"$f":"INDEX(ET.region!$A$51:$M$61,MATCH(ET.county!$B72,ET.region!$A$51:$A$61,0),MATCH(ET.county!G$1,ET.region!$A$51:$M$51,0))","v":6.2976377952755911},{"$f":"INDEX(ET.region!$A$51:$M$61,MATCH(ET.county!$B72,ET.region!$A$51:$A$61,0),MATCH(ET.county!H$1,ET.region!$A$51:$M$51,0))","v":6.6141732283464565},{"$f":"INDEX(ET.region!$A$51:$M$61,MATCH(ET.county!$B72,ET.region!$A$51:$A$61,0),MATCH(ET.county!I$1,ET.region!$A$51:$M$51,0))","v":6.8590551181102368},{"$f":"INDEX(ET.region!$A$51:$M$61,MATCH(ET.county!$B72,ET.region!$A$51:$A$61,0),MATCH(ET.county!J$1,ET.region!$A$51:$M$51,0))","v":6.1755905511811022},{"$f":"INDEX(ET.region!$A$51:$M$61,MATCH(ET.county!$B72,ET.region!$A$51:$A$61,0),MATCH(ET.county!K$1,ET.region!$A$51:$M$51,0))","v":4.8661417322834648},{"$f":"INDEX(ET.region!$A$51:$M$61,MATCH(ET.county!$B72,ET.region!$A$51:$A$61,0),MATCH(ET.county!L$1,ET.region!$A$51:$M$51,0))","v":3.6370078740157483},{"$f":"INDEX(ET.region!$A$51:$M$61,MATCH(ET.county!$B72,ET.region!$A$51:$A$61,0),MATCH(ET.county!M$1,ET.region!$A$51:$M$51,0))","v":2.3622047244094486},{"$f":"INDEX(ET.region!$A$51:$M$61,MATCH(ET.county!$B72,ET.region!$A$51:$A$61,0),MATCH(ET.county!N$1,ET.region!$A$51:$M$51,0))","v":1.684251968503937}]
["Perquimans","Lewiston",{"$f":"INDEX(ET.region!$A$51:$M$61,MATCH(ET.county!$B73,ET.region!$A$51:$A$61,0),MATCH(ET.county!C$1,ET.region!$A$51:$M$51,0))","v":1.5255905511811025},{"$f":"INDEX(ET.region!$A$51:$M$61,MATCH(ET.county!$B73,ET.region!$A$51:$A$61,0),MATCH(ET.county!D$1,ET.region!$A$51:$M$51,0))","v":2.0173228346456695},{"$f":"INDEX(ET.region!$A$51:$M$61,MATCH(ET.county!$B73,ET.region!$A$51:$A$61,0),MATCH(ET.county!E$1,ET.region!$A$51:$M$51,0))","v":3.4905511811023624},{"$f":"INDEX(ET.region!$A$51:$M$61,MATCH(ET.county!$B73,ET.region!$A$51:$A$61,0),MATCH(ET.county!F$1,ET.region!$A$51:$M$51,0))","v":5.0551181102362204},{"$f":"INDEX(ET.region!$A$51:$M$61,MATCH(ET.county!$B73,ET.region!$A$51:$A$61,0),MATCH(ET.county!G$1,ET.region!$A$51:$M$51,0))","v":6.4318897637795267},{"$f":"INDEX(ET.region!$A$51:$M$61,MATCH(ET.county!$B73,ET.region!$A$51:$A$61,0),MATCH(ET.county!H$1,ET.region!$A$51:$M$51,0))","v":7.0748031496063},{"$f":"INDEX(ET.region!$A$51:$M$61,MATCH(ET.county!$B73,ET.region!$A$51:$A$61,0),MATCH(ET.county!I$1,ET.region!$A$51:$M$51,0))","v":7.359448818897639},{"$f":"INDEX(ET.region!$A$51:$M$61,MATCH(ET.county!$B73,ET.region!$A$51:$A$61,0),MATCH(ET.county!J$1,ET.region!$A$51:$M$51,0))","v":6.566141732283465},{"$f":"INDEX(ET.region!$A$51:$M$61,MATCH(ET.county!$B73,ET.region!$A$51:$A$61,0),MATCH(ET.county!K$1,ET.region!$A$51:$M$51,0))","v":4.9488188976377963},{"$f":"INDEX(ET.region!$A$51:$M$61,MATCH(ET.county!$B73,ET.region!$A$51:$A$61,0),MATCH(ET.county!L$1,ET.region!$A$51:$M$51,0))","v":3.5759842519685043},{"$f":"INDEX(ET.region!$A$51:$M$61,MATCH(ET.county!$B73,ET.region!$A$51:$A$61,0),MATCH(ET.county!M$1,ET.region!$A$51:$M$51,0))","v":2.1968503937007875},{"$f":"INDEX(ET.region!$A$51:$M$61,MATCH(ET.county!$B73,ET.region!$A$51:$A$61,0),MATCH(ET.county!N$1,ET.region!$A$51:$M$51,0))","v":1.5255905511811025}]
["Person ","Reidsville",{"$f":"INDEX(ET.region!$A$51:$M$61,MATCH(ET.county!$B74,ET.region!$A$51:$A$61,0),MATCH(ET.county!C$1,ET.region!$A$51:$M$51,0))","v":1.3425196850393704},{"$f":"INDEX(ET.region!$A$51:$M$61,MATCH(ET.county!$B74,ET.region!$A$51:$A$61,0),MATCH(ET.county!D$1,ET.region!$A$51:$M$51,0))","v":1.7637795275590555},{"$f":"INDEX(ET.region!$A$51:$M$61,MATCH(ET.county!$B74,ET.region!$A$51:$A$61,0),MATCH(ET.county!E$1,ET.region!$A$51:$M$51,0))","v":3.0877952755905511},{"$f":"INDEX(ET.region!$A$51:$M$61,MATCH(ET.county!$B74,ET.region!$A$51:$A$61,0),MATCH(ET.county!F$1,ET.region!$A$51:$M$51,0))","v":4.4763779527559056},{"$f":"INDEX(ET.region!$A$51:$M$61,MATCH(ET.county!$B74,ET.region!$A$51:$A$61,0),MATCH(ET.county!G$1,ET.region!$A$51:$M$51,0))","v":5.8216535433070868},{"$f":"INDEX(ET.region!$A$51:$M$61,MATCH(ET.county!$B74,ET.region!$A$51:$A$61,0),MATCH(ET.county!H$1,ET.region!$A$51:$M$51,0))","v":6.4842519685039379},{"$f":"INDEX(ET.region!$A$51:$M$61,MATCH(ET.county!$B74,ET.region!$A$51:$A$61,0),MATCH(ET.county!I$1,ET.region!$A$51:$M$51,0))","v":6.8346456692913389},{"$f":"INDEX(ET.region!$A$51:$M$61,MATCH(ET.county!$B74,ET.region!$A$51:$A$61,0),MATCH(ET.county!J$1,ET.region!$A$51:$M$51,0))","v":6.1267716535433072},{"$f":"INDEX(ET.region!$A$51:$M$61,MATCH(ET.county!$B74,ET.region!$A$51:$A$61,0),MATCH(ET.county!K$1,ET.region!$A$51:$M$51,0))","v":4.5826771653543314},{"$f":"INDEX(ET.region!$A$51:$M$61,MATCH(ET.county!$B74,ET.region!$A$51:$A$61,0),MATCH(ET.county!L$1,ET.region!$A$51:$M$51,0))","v":3.246456692913386},{"$f":"INDEX(ET.region!$A$51:$M$61,MATCH(ET.county!$B74,ET.region!$A$51:$A$61,0),MATCH(ET.county!M$1,ET.region!$A$51:$M$51,0))","v":1.9488188976377951},{"$f":"INDEX(ET.region!$A$51:$M$61,MATCH(ET.county!$B74,ET.region!$A$51:$A$61,0),MATCH(ET.county!N$1,ET.region!$A$51:$M$51,0))","v":1.3181102362204726}]
["Pitt ","Goldsboro",{"$f":"INDEX(ET.region!$A$51:$M$61,MATCH(ET.county!$B75,ET.region!$A$51:$A$61,0),MATCH(ET.county!C$1,ET.region!$A$51:$M$51,0))","v":1.5744094488188978},{"$f":"INDEX(ET.region!$A$51:$M$61,MATCH(ET.county!$B75,ET.region!$A$51:$A$61,0),MATCH(ET.county!D$1,ET.region!$A$51:$M$51,0))","v":2.0173228346456695},{"$f":"INDEX(ET.region!$A$51:$M$61,MATCH(ET.county!$B75,ET.region!$A$51:$A$61,0),MATCH(ET.county!E$1,ET.region!$A$51:$M$51,0))","v":3.4661417322834644},{"$f":"INDEX(ET.region!$A$51:$M$61,MATCH(ET.county!$B75,ET.region!$A$51:$A$61,0),MATCH(ET.county!F$1,ET.region!$A$51:$M$51,0))","v":4.877952755905512},{"$f":"INDEX(ET.region!$A$51:$M$61,MATCH(ET.county!$B75,ET.region!$A$51:$A$61,0),MATCH(ET.county!G$1,ET.region!$A$51:$M$51,0))","v":6.2976377952755911},{"$f":"INDEX(ET.region!$A$51:$M$61,MATCH(ET.county!$B75,ET.region!$A$51:$A$61,0),MATCH(ET.county!H$1,ET.region!$A$51:$M$51,0))","v":6.6968503937007879},{"$f":"INDEX(ET.region!$A$51:$M$61,MATCH(ET.county!$B75,ET.region!$A$51:$A$61,0),MATCH(ET.county!I$1,ET.region!$A$51:$M$51,0))","v":6.8346456692913389},{"$f":"INDEX(ET.region!$A$51:$M$61,MATCH(ET.county!$B75,ET.region!$A$51:$A$61,0),MATCH(ET.county!J$1,ET.region!$A$51:$M$51,0))","v":6.1145669291338578},{"$f":"INDEX(ET.region!$A$51:$M$61,MATCH(ET.county!$B75,ET.region!$A$51:$A$61,0),MATCH(ET.county!K$1,ET.region!$A$51:$M$51,0))","v":4.7125984251968509},{"$f":"INDEX(ET.region!$A$51:$M$61,MATCH(ET.county!$B75,ET.region!$A$51:$A$61,0),MATCH(ET.county!L$1,ET.region!$A$51:$M$51,0))","v":3.4661417322834644},{"$f":"INDEX(ET.region!$A$51:$M$61,MATCH(ET.county!$B75,ET.region!$A$51:$A$61,0),MATCH(ET.county!M$1,ET.region!$A$51:$M$51,0))","v":2.1968503937007875},{"$f":"INDEX(ET.region!$A$51:$M$61,MATCH(ET.county!$B75,ET.region!$A$51:$A$61,0),MATCH(ET.county!N$1,ET.region!$A$51:$M$51,0))","v":1.55}]
["Polk ","Lenoir",{"$f":"INDEX(ET.region!$A$51:$M$61,MATCH(ET.county!$B76,ET.region!$A$51:$A$61,0),MATCH(ET.county!C$1,ET.region!$A$51:$M$51,0))","v":1.4523622047244096},{"$f":"INDEX(ET.region!$A$51:$M$61,MATCH(ET.county!$B76,ET.region!$A$51:$A$61,0),MATCH(ET.county!D$1,ET.region!$A$51:$M$51,0))","v":1.8850393700787402},{"$f":"INDEX(ET.region!$A$51:$M$61,MATCH(ET.county!$B76,ET.region!$A$51:$A$61,0),MATCH(ET.county!E$1,ET.region!$A$51:$M$51,0))","v":3.1610236220472441},{"$f":"INDEX(ET.region!$A$51:$M$61,MATCH(ET.county!$B76,ET.region!$A$51:$A$61,0),MATCH(ET.county!F$1,ET.region!$A$51:$M$51,0))","v":4.346456692913387},{"$f":"INDEX(ET.region!$A$51:$M$61,MATCH(ET.county!$B76,ET.region!$A$51:$A$61,0),MATCH(ET.county!G$1,ET.region!$A$51:$M$51,0))","v":5.333464566929135},{"$f":"INDEX(ET.region!$A$51:$M$61,MATCH(ET.county!$B76,ET.region!$A$51:$A$61,0),MATCH(ET.county!H$1,ET.region!$A$51:$M$51,0))","v":5.5748031496062991},{"$f":"INDEX(ET.region!$A$51:$M$61,MATCH(ET.county!$B76,ET.region!$A$51:$A$61,0),MATCH(ET.county!I$1,ET.region!$A$51:$M$51,0))","v":5.6751968503937018},{"$f":"INDEX(ET.region!$A$51:$M$61,MATCH(ET.county!$B76,ET.region!$A$51:$A$61,0),MATCH(ET.county!J$1,ET.region!$A$51:$M$51,0))","v":5.0893700787401581},{"$f":"INDEX(ET.region!$A$51:$M$61,MATCH(ET.county!$B76,ET.region!$A$51:$A$61,0),MATCH(ET.county!K$1,ET.region!$A$51:$M$51,0))","v":4.015748031496063},{"$f":"INDEX(ET.region!$A$51:$M$61,MATCH(ET.county!$B76,ET.region!$A$51:$A$61,0),MATCH(ET.county!L$1,ET.region!$A$51:$M$51,0))","v":3.0633858267716536},{"$f":"INDEX(ET.region!$A$51:$M$61,MATCH(ET.county!$B76,ET.region!$A$51:$A$61,0),MATCH(ET.county!M$1,ET.region!$A$51:$M$51,0))","v":1.9606299212598426},{"$f":"INDEX(ET.region!$A$51:$M$61,MATCH(ET.county!$B76,ET.region!$A$51:$A$61,0),MATCH(ET.county!N$1,ET.region!$A$51:$M$51,0))","v":1.3913385826771654}]
["Randolph ","Salisbury",{"$f":"INDEX(ET.region!$A$51:$M$61,MATCH(ET.county!$B77,ET.region!$A$51:$A$61,0),MATCH(ET.county!C$1,ET.region!$A$51:$M$51,0))","v":1.4889763779527558},{"$f":"INDEX(ET.region!$A$51:$M$61,MATCH(ET.county!$B77,ET.region!$A$51:$A$61,0),MATCH(ET.county!D$1,ET.region!$A$51:$M$51,0))","v":1.9401574803149606},{"$f":"INDEX(ET.region!$A$51:$M$61,MATCH(ET.county!$B77,ET.region!$A$51:$A$61,0),MATCH(ET.county!E$1,ET.region!$A$51:$M$51,0))","v":3.2952755905511819},{"$f":"INDEX(ET.region!$A$51:$M$61,MATCH(ET.county!$B77,ET.region!$A$51:$A$61,0),MATCH(ET.county!F$1,ET.region!$A$51:$M$51,0))","v":4.7007874015748037},{"$f":"INDEX(ET.region!$A$51:$M$61,MATCH(ET.county!$B77,ET.region!$A$51:$A$61,0),MATCH(ET.county!G$1,ET.region!$A$51:$M$51,0))","v":6.0169291338582678},{"$f":"INDEX(ET.region!$A$51:$M$61,MATCH(ET.county!$B77,ET.region!$A$51:$A$61,0),MATCH(ET.county!H$1,ET.region!$A$51:$M$51,0))","v":6.6496062992125982},{"$f":"INDEX(ET.region!$A$51:$M$61,MATCH(ET.county!$B77,ET.region!$A$51:$A$61,0),MATCH(ET.county!I$1,ET.region!$A$51:$M$51,0))","v":6.9322834645669289},{"$f":"INDEX(ET.region!$A$51:$M$61,MATCH(ET.county!$B77,ET.region!$A$51:$A$61,0),MATCH(ET.county!J$1,ET.region!$A$51:$M$51,0))","v":6.1755905511811022},{"$f":"INDEX(ET.region!$A$51:$M$61,MATCH(ET.county!$B77,ET.region!$A$51:$A$61,0),MATCH(ET.county!K$1,ET.region!$A$51:$M$51,0))","v":4.7125984251968509},{"$f":"INDEX(ET.region!$A$51:$M$61,MATCH(ET.county!$B77,ET.region!$A$51:$A$61,0),MATCH(ET.county!L$1,ET.region!$A$51:$M$51,0))","v":3.4173228346456694},{"$f":"INDEX(ET.region!$A$51:$M$61,MATCH(ET.county!$B77,ET.region!$A$51:$A$61,0),MATCH(ET.county!M$1,ET.region!$A$51:$M$51,0))","v":2.1141732283464569},{"$f":"INDEX(ET.region!$A$51:$M$61,MATCH(ET.county!$B77,ET.region!$A$51:$A$61,0),MATCH(ET.county!N$1,ET.region!$A$51:$M$51,0))","v":1.4523622047244096}]
["Richmond ","Jackson.Springs",{"$f":"INDEX(ET.region!$A$51:$M$61,MATCH(ET.county!$B78,ET.region!$A$51:$A$61,0),MATCH(ET.county!C$1,ET.region!$A$51:$M$51,0))","v":1.5011811023622048},{"$f":"INDEX(ET.region!$A$51:$M$61,MATCH(ET.county!$B78,ET.region!$A$51:$A$61,0),MATCH(ET.county!D$1,ET.region!$A$51:$M$51,0))","v":1.9622047244094489},{"$f":"INDEX(ET.region!$A$51:$M$61,MATCH(ET.county!$B78,ET.region!$A$51:$A$61,0),MATCH(ET.county!E$1,ET.region!$A$51:$M$51,0))","v":3.4051181102362205},{"$f":"INDEX(ET.region!$A$51:$M$61,MATCH(ET.county!$B78,ET.region!$A$51:$A$61,0),MATCH(ET.county!F$1,ET.region!$A$51:$M$51,0))","v":4.8661417322834648},{"$f":"INDEX(ET.region!$A$51:$M$61,MATCH(ET.county!$B78,ET.region!$A$51:$A$61,0),MATCH(ET.county!G$1,ET.region!$A$51:$M$51,0))","v":6.1755905511811022},{"$f":"INDEX(ET.region!$A$51:$M$61,MATCH(ET.county!$B78,ET.region!$A$51:$A$61,0),MATCH(ET.county!H$1,ET.region!$A$51:$M$51,0))","v":6.7440944881889759},{"$f":"INDEX(ET.region!$A$51:$M$61,MATCH(ET.county!$B78,ET.region!$A$51:$A$61,0),MATCH(ET.county!I$1,ET.region!$A$51:$M$51,0))","v":7.0055118110236227},{"$f":"INDEX(ET.region!$A$51:$M$61,MATCH(ET.county!$B78,ET.region!$A$51:$A$61,0),MATCH(ET.county!J$1,ET.region!$A$51:$M$51,0))","v":6.2244094488188981},{"$f":"INDEX(ET.region!$A$51:$M$61,MATCH(ET.county!$B78,ET.region!$A$51:$A$61,0),MATCH(ET.county!K$1,ET.region!$A$51:$M$51,0))","v":4.771653543307087},{"$f":"INDEX(ET.region!$A$51:$M$61,MATCH(ET.county!$B78,ET.region!$A$51:$A$61,0),MATCH(ET.county!L$1,ET.region!$A$51:$M$51,0))","v":3.4051181102362205},{"$f":"INDEX(ET.region!$A$51:$M$61,MATCH(ET.county!$B78,ET.region!$A$51:$A$61,0),MATCH(ET.county!M$1,ET.region!$A$51:$M$51,0))","v":2.0905511811023625},{"$f":"INDEX(ET.region!$A$51:$M$61,MATCH(ET.county!$B78,ET.region!$A$51:$A$61,0),MATCH(ET.county!N$1,ET.region!$A$51:$M$51,0))","v":1.4889763779527558}]
["Robeson ","Whiteville",{"$f":"INDEX(ET.region!$A$51:$M$61,MATCH(ET.county!$B79,ET.region!$A$51:$A$61,0),MATCH(ET.county!C$1,ET.region!$A$51:$M$51,0))","v":1.6964566929133857},{"$f":"INDEX(ET.region!$A$51:$M$61,MATCH(ET.county!$B79,ET.region!$A$51:$A$61,0),MATCH(ET.county!D$1,ET.region!$A$51:$M$51,0))","v":2.1496062992125986},{"$f":"INDEX(ET.region!$A$51:$M$61,MATCH(ET.county!$B79,ET.region!$A$51:$A$61,0),MATCH(ET.county!E$1,ET.region!$A$51:$M$51,0))","v":3.6248031496062993},{"$f":"INDEX(ET.region!$A$51:$M$61,MATCH(ET.county!$B79,ET.region!$A$51:$A$61,0),MATCH(ET.county!F$1,ET.region!$A$51:$M$51,0))","v":4.9724409448818898},{"$f":"INDEX(ET.region!$A$51:$M$61,MATCH(ET.county!$B79,ET.region!$A$51:$A$61,0),MATCH(ET.county!G$1,ET.region!$A$51:$M$51,0))","v":6.2976377952755911},{"$f":"INDEX(ET.region!$A$51:$M$61,MATCH(ET.county!$B79,ET.region!$A$51:$A$61,0),MATCH(ET.county!H$1,ET.region!$A$51:$M$51,0))","v":6.6141732283464565},{"$f":"INDEX(ET.region!$A$51:$M$61,MATCH(ET.county!$B79,ET.region!$A$51:$A$61,0),MATCH(ET.county!I$1,ET.region!$A$51:$M$51,0))","v":6.8590551181102368},{"$f":"INDEX(ET.region!$A$51:$M$61,MATCH(ET.county!$B79,ET.region!$A$51:$A$61,0),MATCH(ET.county!J$1,ET.region!$A$51:$M$51,0))","v":6.1755905511811022},{"$f":"INDEX(ET.region!$A$51:$M$61,MATCH(ET.county!$B79,ET.region!$A$51:$A$61,0),MATCH(ET.county!K$1,ET.region!$A$51:$M$51,0))","v":4.8661417322834648},{"$f":"INDEX(ET.region!$A$51:$M$61,MATCH(ET.county!$B79,ET.region!$A$51:$A$61,0),MATCH(ET.county!L$1,ET.region!$A$51:$M$51,0))","v":3.6370078740157483},{"$f":"INDEX(ET.region!$A$51:$M$61,MATCH(ET.county!$B79,ET.region!$A$51:$A$61,0),MATCH(ET.county!M$1,ET.region!$A$51:$M$51,0))","v":2.3622047244094486},{"$f":"INDEX(ET.region!$A$51:$M$61,MATCH(ET.county!$B79,ET.region!$A$51:$A$61,0),MATCH(ET.county!N$1,ET.region!$A$51:$M$51,0))","v":1.684251968503937}]
["Rockingham ","Reidsville",{"$f":"INDEX(ET.region!$A$51:$M$61,MATCH(ET.county!$B80,ET.region!$A$51:$A$61,0),MATCH(ET.county!C$1,ET.region!$A$51:$M$51,0))","v":1.3425196850393704},{"$f":"INDEX(ET.region!$A$51:$M$61,MATCH(ET.county!$B80,ET.region!$A$51:$A$61,0),MATCH(ET.county!D$1,ET.region!$A$51:$M$51,0))","v":1.7637795275590555},{"$f":"INDEX(ET.region!$A$51:$M$61,MATCH(ET.county!$B80,ET.region!$A$51:$A$61,0),MATCH(ET.county!E$1,ET.region!$A$51:$M$51,0))","v":3.0877952755905511},{"$f":"INDEX(ET.region!$A$51:$M$61,MATCH(ET.county!$B80,ET.region!$A$51:$A$61,0),MATCH(ET.county!F$1,ET.region!$A$51:$M$51,0))","v":4.4763779527559056},{"$f":"INDEX(ET.region!$A$51:$M$61,MATCH(ET.county!$B80,ET.region!$A$51:$A$61,0),MATCH(ET.county!G$1,ET.region!$A$51:$M$51,0))","v":5.8216535433070868},{"$f":"INDEX(ET.region!$A$51:$M$61,MATCH(ET.county!$B80,ET.region!$A$51:$A$61,0),MATCH(ET.county!H$1,ET.region!$A$51:$M$51,0))","v":6.4842519685039379},{"$f":"INDEX(ET.region!$A$51:$M$61,MATCH(ET.county!$B80,ET.region!$A$51:$A$61,0),MATCH(ET.county!I$1,ET.region!$A$51:$M$51,0))","v":6.8346456692913389},{"$f":"INDEX(ET.region!$A$51:$M$61,MATCH(ET.county!$B80,ET.region!$A$51:$A$61,0),MATCH(ET.county!J$1,ET.region!$A$51:$M$51,0))","v":6.1267716535433072},{"$f":"INDEX(ET.region!$A$51:$M$61,MATCH(ET.county!$B80,ET.region!$A$51:$A$61,0),MATCH(ET.county!K$1,ET.region!$A$51:$M$51,0))","v":4.5826771653543314},{"$f":"INDEX(ET.region!$A$51:$M$61,MATCH(ET.county!$B80,ET.region!$A$51:$A$61,0),MATCH(ET.county!L$1,ET.region!$A$51:$M$51,0))","v":3.246456692913386},{"$f":"INDEX(ET.region!$A$51:$M$61,MATCH(ET.county!$B80,ET.region!$A$51:$A$61,0),MATCH(ET.county!M$1,ET.region!$A$51:$M$51,0))","v":1.9488188976377951},{"$f":"INDEX(ET.region!$A$51:$M$61,MATCH(ET.county!$B80,ET.region!$A$51:$A$61,0),MATCH(ET.county!N$1,ET.region!$A$51:$M$51,0))","v":1.3181102362204726}]
["Rowan ","salisbury",{"$f":"INDEX(ET.region!$A$51:$M$61,MATCH(ET.county!$B81,ET.region!$A$51:$A$61,0),MATCH(ET.county!C$1,ET.region!$A$51:$M$51,0))","v":1.4889763779527558},{"$f":"INDEX(ET.region!$A$51:$M$61,MATCH(ET.county!$B81,ET.region!$A$51:$A$61,0),MATCH(ET.county!D$1,ET.region!$A$51:$M$51,0))","v":1.9401574803149606},{"$f":"INDEX(ET.region!$A$51:$M$61,MATCH(ET.county!$B81,ET.region!$A$51:$A$61,0),MATCH(ET.county!E$1,ET.region!$A$51:$M$51,0))","v":3.2952755905511819},{"$f":"INDEX(ET.region!$A$51:$M$61,MATCH(ET.county!$B81,ET.region!$A$51:$A$61,0),MATCH(ET.county!F$1,ET.region!$A$51:$M$51,0))","v":4.7007874015748037},{"$f":"INDEX(ET.region!$A$51:$M$61,MATCH(ET.county!$B81,ET.region!$A$51:$A$61,0),MATCH(ET.county!G$1,ET.region!$A$51:$M$51,0))","v":6.0169291338582678},{"$f":"INDEX(ET.region!$A$51:$M$61,MATCH(ET.county!$B81,ET.region!$A$51:$A$61,0),MATCH(ET.county!H$1,ET.region!$A$51:$M$51,0))","v":6.6496062992125982},{"$f":"INDEX(ET.region!$A$51:$M$61,MATCH(ET.county!$B81,ET.region!$A$51:$A$61,0),MATCH(ET.county!I$1,ET.region!$A$51:$M$51,0))","v":6.9322834645669289},{"$f":"INDEX(ET.region!$A$51:$M$61,MATCH(ET.county!$B81,ET.region!$A$51:$A$61,0),MATCH(ET.county!J$1,ET.region!$A$51:$M$51,0))","v":6.1755905511811022},{"$f":"INDEX(ET.region!$A$51:$M$61,MATCH(ET.county!$B81,ET.region!$A$51:$A$61,0),MATCH(ET.county!K$1,ET.region!$A$51:$M$51,0))","v":4.7125984251968509},{"$f":"INDEX(ET.region!$A$51:$M$61,MATCH(ET.county!$B81,ET.region!$A$51:$A$61,0),MATCH(ET.county!L$1,ET.region!$A$51:$M$51,0))","v":3.4173228346456694},{"$f":"INDEX(ET.region!$A$51:$M$61,MATCH(ET.county!$B81,ET.region!$A$51:$A$61,0),MATCH(ET.county!M$1,ET.region!$A$51:$M$51,0))","v":2.1141732283464569},{"$f":"INDEX(ET.region!$A$51:$M$61,MATCH(ET.county!$B81,ET.region!$A$51:$A$61,0),MATCH(ET.county!N$1,ET.region!$A$51:$M$51,0))","v":1.4523622047244096}]
["Rutherford ","Lenoir",{"$f":"INDEX(ET.region!$A$51:$M$61,MATCH(ET.county!$B82,ET.region!$A$51:$A$61,0),MATCH(ET.county!C$1,ET.region!$A$51:$M$51,0))","v":1.4523622047244096},{"$f":"INDEX(ET.region!$A$51:$M$61,MATCH(ET.county!$B82,ET.region!$A$51:$A$61,0),MATCH(ET.county!D$1,ET.region!$A$51:$M$51,0))","v":1.8850393700787402},{"$f":"INDEX(ET.region!$A$51:$M$61,MATCH(ET.county!$B82,ET.region!$A$51:$A$61,0),MATCH(ET.county!E$1,ET.region!$A$51:$M$51,0))","v":3.1610236220472441},{"$f":"INDEX(ET.region!$A$51:$M$61,MATCH(ET.county!$B82,ET.region!$A$51:$A$61,0),MATCH(ET.county!F$1,ET.region!$A$51:$M$51,0))","v":4.346456692913387},{"$f":"INDEX(ET.region!$A$51:$M$61,MATCH(ET.county!$B82,ET.region!$A$51:$A$61,0),MATCH(ET.county!G$1,ET.region!$A$51:$M$51,0))","v":5.333464566929135},{"$f":"INDEX(ET.region!$A$51:$M$61,MATCH(ET.county!$B82,ET.region!$A$51:$A$61,0),MATCH(ET.county!H$1,ET.region!$A$51:$M$51,0))","v":5.5748031496062991},{"$f":"INDEX(ET.region!$A$51:$M$61,MATCH(ET.county!$B82,ET.region!$A$51:$A$61,0),MATCH(ET.county!I$1,ET.region!$A$51:$M$51,0))","v":5.6751968503937018},{"$f":"INDEX(ET.region!$A$51:$M$61,MATCH(ET.county!$B82,ET.region!$A$51:$A$61,0),MATCH(ET.county!J$1,ET.region!$A$51:$M$51,0))","v":5.0893700787401581},{"$f":"INDEX(ET.region!$A$51:$M$61,MATCH(ET.county!$B82,ET.region!$A$51:$A$61,0),MATCH(ET.county!K$1,ET.region!$A$51:$M$51,0))","v":4.015748031496063},{"$f":"INDEX(ET.region!$A$51:$M$61,MATCH(ET.county!$B82,ET.region!$A$51:$A$61,0),MATCH(ET.county!L$1,ET.region!$A$51:$M$51,0))","v":3.0633858267716536},{"$f":"INDEX(ET.region!$A$51:$M$61,MATCH(ET.county!$B82,ET.region!$A$51:$A$61,0),MATCH(ET.county!M$1,ET.region!$A$51:$M$51,0))","v":1.9606299212598426},{"$f":"INDEX(ET.region!$A$51:$M$61,MATCH(ET.county!$B82,ET.region!$A$51:$A$61,0),MATCH(ET.county!N$1,ET.region!$A$51:$M$51,0))","v":1.3913385826771654}]
["Sampson ","Goldsboro",{"$f":"INDEX(ET.region!$A$51:$M$61,MATCH(ET.county!$B83,ET.region!$A$51:$A$61,0),MATCH(ET.county!C$1,ET.region!$A$51:$M$51,0))","v":1.5744094488188978},{"$f":"INDEX(ET.region!$A$51:$M$61,MATCH(ET.county!$B83,ET.region!$A$51:$A$61,0),MATCH(ET.county!D$1,ET.region!$A$51:$M$51,0))","v":2.0173228346456695},{"$f":"INDEX(ET.region!$A$51:$M$61,MATCH(ET.county!$B83,ET.region!$A$51:$A$61,0),MATCH(ET.county!E$1,ET.region!$A$51:$M$51,0))","v":3.4661417322834644},{"$f":"INDEX(ET.region!$A$51:$M$61,MATCH(ET.county!$B83,ET.region!$A$51:$A$61,0),MATCH(ET.county!F$1,ET.region!$A$51:$M$51,0))","v":4.877952755905512},{"$f":"INDEX(ET.region!$A$51:$M$61,MATCH(ET.county!$B83,ET.region!$A$51:$A$61,0),MATCH(ET.county!G$1,ET.region!$A$51:$M$51,0))","v":6.2976377952755911},{"$f":"INDEX(ET.region!$A$51:$M$61,MATCH(ET.county!$B83,ET.region!$A$51:$A$61,0),MATCH(ET.county!H$1,ET.region!$A$51:$M$51,0))","v":6.6968503937007879},{"$f":"INDEX(ET.region!$A$51:$M$61,MATCH(ET.county!$B83,ET.region!$A$51:$A$61,0),MATCH(ET.county!I$1,ET.region!$A$51:$M$51,0))","v":6.8346456692913389},{"$f":"INDEX(ET.region!$A$51:$M$61,MATCH(ET.county!$B83,ET.region!$A$51:$A$61,0),MATCH(ET.county!J$1,ET.region!$A$51:$M$51,0))","v":6.1145669291338578},{"$f":"INDEX(ET.region!$A$51:$M$61,MATCH(ET.county!$B83,ET.region!$A$51:$A$61,0),MATCH(ET.county!K$1,ET.region!$A$51:$M$51,0))","v":4.7125984251968509},{"$f":"INDEX(ET.region!$A$51:$M$61,MATCH(ET.county!$B83,ET.region!$A$51:$A$61,0),MATCH(ET.county!L$1,ET.region!$A$51:$M$51,0))","v":3.4661417322834644},{"$f":"INDEX(ET.region!$A$51:$M$61,MATCH(ET.county!$B83,ET.region!$A$51:$A$61,0),MATCH(ET.county!M$1,ET.region!$A$51:$M$51,0))","v":2.1968503937007875},{"$f":"INDEX(ET.region!$A$51:$M$61,MATCH(ET.county!$B83,ET.region!$A$51:$A$61,0),MATCH(ET.county!N$1,ET.region!$A$51:$M$51,0))","v":1.55}]
["Scotland ","Jackson.Springs",{"$f":"INDEX(ET.region!$A$51:$M$61,MATCH(ET.county!$B84,ET.region!$A$51:$A$61,0),MATCH(ET.county!C$1,ET.region!$A$51:$M$51,0))","v":1.5011811023622048},{"$f":"INDEX(ET.region!$A$51:$M$61,MATCH(ET.county!$B84,ET.region!$A$51:$A$61,0),MATCH(ET.county!D$1,ET.region!$A$51:$M$51,0))","v":1.9622047244094489},{"$f":"INDEX(ET.region!$A$51:$M$61,MATCH(ET.county!$B84,ET.region!$A$51:$A$61,0),MATCH(ET.county!E$1,ET.region!$A$51:$M$51,0))","v":3.4051181102362205},{"$f":"INDEX(ET.region!$A$51:$M$61,MATCH(ET.county!$B84,ET.region!$A$51:$A$61,0),MATCH(ET.county!F$1,ET.region!$A$51:$M$51,0))","v":4.8661417322834648},{"$f":"INDEX(ET.region!$A$51:$M$61,MATCH(ET.county!$B84,ET.region!$A$51:$A$61,0),MATCH(ET.county!G$1,ET.region!$A$51:$M$51,0))","v":6.1755905511811022},{"$f":"INDEX(ET.region!$A$51:$M$61,MATCH(ET.county!$B84,ET.region!$A$51:$A$61,0),MATCH(ET.county!H$1,ET.region!$A$51:$M$51,0))","v":6.7440944881889759},{"$f":"INDEX(ET.region!$A$51:$M$61,MATCH(ET.county!$B84,ET.region!$A$51:$A$61,0),MATCH(ET.county!I$1,ET.region!$A$51:$M$51,0))","v":7.0055118110236227},{"$f":"INDEX(ET.region!$A$51:$M$61,MATCH(ET.county!$B84,ET.region!$A$51:$A$61,0),MATCH(ET.county!J$1,ET.region!$A$51:$M$51,0))","v":6.2244094488188981},{"$f":"INDEX(ET.region!$A$51:$M$61,MATCH(ET.county!$B84,ET.region!$A$51:$A$61,0),MATCH(ET.county!K$1,ET.region!$A$51:$M$51,0))","v":4.771653543307087},{"$f":"INDEX(ET.region!$A$51:$M$61,MATCH(ET.county!$B84,ET.region!$A$51:$A$61,0),MATCH(ET.county!L$1,ET.region!$A$51:$M$51,0))","v":3.4051181102362205},{"$f":"INDEX(ET.region!$A$51:$M$61,MATCH(ET.county!$B84,ET.region!$A$51:$A$61,0),MATCH(ET.county!M$1,ET.region!$A$51:$M$51,0))","v":2.0905511811023625},{"$f":"INDEX(ET.region!$A$51:$M$61,MATCH(ET.county!$B84,ET.region!$A$51:$A$61,0),MATCH(ET.county!N$1,ET.region!$A$51:$M$51,0))","v":1.4889763779527558}]
["Stanly  ","Salisbury",{"$f":"INDEX(ET.region!$A$51:$M$61,MATCH(ET.county!$B85,ET.region!$A$51:$A$61,0),MATCH(ET.county!C$1,ET.region!$A$51:$M$51,0))","v":1.4889763779527558},{"$f":"INDEX(ET.region!$A$51:$M$61,MATCH(ET.county!$B85,ET.region!$A$51:$A$61,0),MATCH(ET.county!D$1,ET.region!$A$51:$M$51,0))","v":1.9401574803149606},{"$f":"INDEX(ET.region!$A$51:$M$61,MATCH(ET.county!$B85,ET.region!$A$51:$A$61,0),MATCH(ET.county!E$1,ET.region!$A$51:$M$51,0))","v":3.2952755905511819},{"$f":"INDEX(ET.region!$A$51:$M$61,MATCH(ET.county!$B85,ET.region!$A$51:$A$61,0),MATCH(ET.county!F$1,ET.region!$A$51:$M$51,0))","v":4.7007874015748037},{"$f":"INDEX(ET.region!$A$51:$M$61,MATCH(ET.county!$B85,ET.region!$A$51:$A$61,0),MATCH(ET.county!G$1,ET.region!$A$51:$M$51,0))","v":6.0169291338582678},{"$f":"INDEX(ET.region!$A$51:$M$61,MATCH(ET.county!$B85,ET.region!$A$51:$A$61,0),MATCH(ET.county!H$1,ET.region!$A$51:$M$51,0))","v":6.6496062992125982},{"$f":"INDEX(ET.region!$A$51:$M$61,MATCH(ET.county!$B85,ET.region!$A$51:$A$61,0),MATCH(ET.county!I$1,ET.region!$A$51:$M$51,0))","v":6.9322834645669289},{"$f":"INDEX(ET.region!$A$51:$M$61,MATCH(ET.county!$B85,ET.region!$A$51:$A$61,0),MATCH(ET.county!J$1,ET.region!$A$51:$M$51,0))","v":6.1755905511811022},{"$f":"INDEX(ET.region!$A$51:$M$61,MATCH(ET.county!$B85,ET.region!$A$51:$A$61,0),MATCH(ET.county!K$1,ET.region!$A$51:$M$51,0))","v":4.7125984251968509},{"$f":"INDEX(ET.region!$A$51:$M$61,MATCH(ET.county!$B85,ET.region!$A$51:$A$61,0),MATCH(ET.county!L$1,ET.region!$A$51:$M$51,0))","v":3.4173228346456694},{"$f":"INDEX(ET.region!$A$51:$M$61,MATCH(ET.county!$B85,ET.region!$A$51:$A$61,0),MATCH(ET.county!M$1,ET.region!$A$51:$M$51,0))","v":2.1141732283464569},{"$f":"INDEX(ET.region!$A$51:$M$61,MATCH(ET.county!$B85,ET.region!$A$51:$A$61,0),MATCH(ET.county!N$1,ET.region!$A$51:$M$51,0))","v":1.4523622047244096}]
["Stokes ","Reidsville",{"$f":"INDEX(ET.region!$A$51:$M$61,MATCH(ET.county!$B86,ET.region!$A$51:$A$61,0),MATCH(ET.county!C$1,ET.region!$A$51:$M$51,0))","v":1.3425196850393704},{"$f":"INDEX(ET.region!$A$51:$M$61,MATCH(ET.county!$B86,ET.region!$A$51:$A$61,0),MATCH(ET.county!D$1,ET.region!$A$51:$M$51,0))","v":1.7637795275590555},{"$f":"INDEX(ET.region!$A$51:$M$61,MATCH(ET.county!$B86,ET.region!$A$51:$A$61,0),MATCH(ET.county!E$1,ET.region!$A$51:$M$51,0))","v":3.0877952755905511},{"$f":"INDEX(ET.region!$A$51:$M$61,MATCH(ET.county!$B86,ET.region!$A$51:$A$61,0),MATCH(ET.county!F$1,ET.region!$A$51:$M$51,0))","v":4.4763779527559056},{"$f":"INDEX(ET.region!$A$51:$M$61,MATCH(ET.county!$B86,ET.region!$A$51:$A$61,0),MATCH(ET.county!G$1,ET.region!$A$51:$M$51,0))","v":5.8216535433070868},{"$f":"INDEX(ET.region!$A$51:$M$61,MATCH(ET.county!$B86,ET.region!$A$51:$A$61,0),MATCH(ET.county!H$1,ET.region!$A$51:$M$51,0))","v":6.4842519685039379},{"$f":"INDEX(ET.region!$A$51:$M$61,MATCH(ET.county!$B86,ET.region!$A$51:$A$61,0),MATCH(ET.county!I$1,ET.region!$A$51:$M$51,0))","v":6.8346456692913389},{"$f":"INDEX(ET.region!$A$51:$M$61,MATCH(ET.county!$B86,ET.region!$A$51:$A$61,0),MATCH(ET.county!J$1,ET.region!$A$51:$M$51,0))","v":6.1267716535433072},{"$f":"INDEX(ET.region!$A$51:$M$61,MATCH(ET.county!$B86,ET.region!$A$51:$A$61,0),MATCH(ET.county!K$1,ET.region!$A$51:$M$51,0))","v":4.5826771653543314},{"$f":"INDEX(ET.region!$A$51:$M$61,MATCH(ET.county!$B86,ET.region!$A$51:$A$61,0),MATCH(ET.county!L$1,ET.region!$A$51:$M$51,0))","v":3.246456692913386},{"$f":"INDEX(ET.region!$A$51:$M$61,MATCH(ET.county!$B86,ET.region!$A$51:$A$61,0),MATCH(ET.county!M$1,ET.region!$A$51:$M$51,0))","v":1.9488188976377951},{"$f":"INDEX(ET.region!$A$51:$M$61,MATCH(ET.county!$B86,ET.region!$A$51:$A$61,0),MATCH(ET.county!N$1,ET.region!$A$51:$M$51,0))","v":1.3181102362204726}]
["Surry ","Reidsville",{"$f":"INDEX(ET.region!$A$51:$M$61,MATCH(ET.county!$B87,ET.region!$A$51:$A$61,0),MATCH(ET.county!C$1,ET.region!$A$51:$M$51,0))","v":1.3425196850393704},{"$f":"INDEX(ET.region!$A$51:$M$61,MATCH(ET.county!$B87,ET.region!$A$51:$A$61,0),MATCH(ET.county!D$1,ET.region!$A$51:$M$51,0))","v":1.7637795275590555},{"$f":"INDEX(ET.region!$A$51:$M$61,MATCH(ET.county!$B87,ET.region!$A$51:$A$61,0),MATCH(ET.county!E$1,ET.region!$A$51:$M$51,0))","v":3.0877952755905511},{"$f":"INDEX(ET.region!$A$51:$M$61,MATCH(ET.county!$B87,ET.region!$A$51:$A$61,0),MATCH(ET.county!F$1,ET.region!$A$51:$M$51,0))","v":4.4763779527559056},{"$f":"INDEX(ET.region!$A$51:$M$61,MATCH(ET.county!$B87,ET.region!$A$51:$A$61,0),MATCH(ET.county!G$1,ET.region!$A$51:$M$51,0))","v":5.8216535433070868},{"$f":"INDEX(ET.region!$A$51:$M$61,MATCH(ET.county!$B87,ET.region!$A$51:$A$61,0),MATCH(ET.county!H$1,ET.region!$A$51:$M$51,0))","v":6.4842519685039379},{"$f":"INDEX(ET.region!$A$51:$M$61,MATCH(ET.county!$B87,ET.region!$A$51:$A$61,0),MATCH(ET.county!I$1,ET.region!$A$51:$M$51,0))","v":6.8346456692913389},{"$f":"INDEX(ET.region!$A$51:$M$61,MATCH(ET.county!$B87,ET.region!$A$51:$A$61,0),MATCH(ET.county!J$1,ET.region!$A$51:$M$51,0))","v":6.1267716535433072},{"$f":"INDEX(ET.region!$A$51:$M$61,MATCH(ET.county!$B87,ET.region!$A$51:$A$61,0),MATCH(ET.county!K$1,ET.region!$A$51:$M$51,0))","v":4.5826771653543314},{"$f":"INDEX(ET.region!$A$51:$M$61,MATCH(ET.county!$B87,ET.region!$A$51:$A$61,0),MATCH(ET.county!L$1,ET.region!$A$51:$M$51,0))","v":3.246456692913386},{"$f":"INDEX(ET.region!$A$51:$M$61,MATCH(ET.county!$B87,ET.region!$A$51:$A$61,0),MATCH(ET.county!M$1,ET.region!$A$51:$M$51,0))","v":1.9488188976377951},{"$f":"INDEX(ET.region!$A$51:$M$61,MATCH(ET.county!$B87,ET.region!$A$51:$A$61,0),MATCH(ET.county!N$1,ET.region!$A$51:$M$51,0))","v":1.3181102362204726}]
["Swain ","Fletcher",{"$f":"INDEX(ET.region!$A$51:$M$61,MATCH(ET.county!$B88,ET.region!$A$51:$A$61,0),MATCH(ET.county!C$1,ET.region!$A$51:$M$51,0))","v":1.3913385826771654},{"$f":"INDEX(ET.region!$A$51:$M$61,MATCH(ET.county!$B88,ET.region!$A$51:$A$61,0),MATCH(ET.county!D$1,ET.region!$A$51:$M$51,0))","v":1.7748031496062995},{"$f":"INDEX(ET.region!$A$51:$M$61,MATCH(ET.county!$B88,ET.region!$A$51:$A$61,0),MATCH(ET.county!E$1,ET.region!$A$51:$M$51,0))","v":3.0633858267716536},{"$f":"INDEX(ET.region!$A$51:$M$61,MATCH(ET.county!$B88,ET.region!$A$51:$A$61,0),MATCH(ET.county!F$1,ET.region!$A$51:$M$51,0))","v":4.4173228346456694},{"$f":"INDEX(ET.region!$A$51:$M$61,MATCH(ET.county!$B88,ET.region!$A$51:$A$61,0),MATCH(ET.county!G$1,ET.region!$A$51:$M$51,0))","v":5.7362204724409454},{"$f":"INDEX(ET.region!$A$51:$M$61,MATCH(ET.county!$B88,ET.region!$A$51:$A$61,0),MATCH(ET.county!H$1,ET.region!$A$51:$M$51,0))","v":6.3070866141732287},{"$f":"INDEX(ET.region!$A$51:$M$61,MATCH(ET.county!$B88,ET.region!$A$51:$A$61,0),MATCH(ET.county!I$1,ET.region!$A$51:$M$51,0))","v":6.5417322834645679},{"$f":"INDEX(ET.region!$A$51:$M$61,MATCH(ET.county!$B88,ET.region!$A$51:$A$61,0),MATCH(ET.county!J$1,ET.region!$A$51:$M$51,0))","v":5.9314960629921272},{"$f":"INDEX(ET.region!$A$51:$M$61,MATCH(ET.county!$B88,ET.region!$A$51:$A$61,0),MATCH(ET.county!K$1,ET.region!$A$51:$M$51,0))","v":4.5118110236220472},{"$f":"INDEX(ET.region!$A$51:$M$61,MATCH(ET.county!$B88,ET.region!$A$51:$A$61,0),MATCH(ET.county!L$1,ET.region!$A$51:$M$51,0))","v":3.270866141732284},{"$f":"INDEX(ET.region!$A$51:$M$61,MATCH(ET.county!$B88,ET.region!$A$51:$A$61,0),MATCH(ET.county!M$1,ET.region!$A$51:$M$51,0))","v":1.9724409448818898},{"$f":"INDEX(ET.region!$A$51:$M$61,MATCH(ET.county!$B88,ET.region!$A$51:$A$61,0),MATCH(ET.county!N$1,ET.region!$A$51:$M$51,0))","v":1.3547244094488189}]
["Transylvania ","Fletcher",{"$f":"INDEX(ET.region!$A$51:$M$61,MATCH(ET.county!$B89,ET.region!$A$51:$A$61,0),MATCH(ET.county!C$1,ET.region!$A$51:$M$51,0))","v":1.3913385826771654},{"$f":"INDEX(ET.region!$A$51:$M$61,MATCH(ET.county!$B89,ET.region!$A$51:$A$61,0),MATCH(ET.county!D$1,ET.region!$A$51:$M$51,0))","v":1.7748031496062995},{"$f":"INDEX(ET.region!$A$51:$M$61,MATCH(ET.county!$B89,ET.region!$A$51:$A$61,0),MATCH(ET.county!E$1,ET.region!$A$51:$M$51,0))","v":3.0633858267716536},{"$f":"INDEX(ET.region!$A$51:$M$61,MATCH(ET.county!$B89,ET.region!$A$51:$A$61,0),MATCH(ET.county!F$1,ET.region!$A$51:$M$51,0))","v":4.4173228346456694},{"$f":"INDEX(ET.region!$A$51:$M$61,MATCH(ET.county!$B89,ET.region!$A$51:$A$61,0),MATCH(ET.county!G$1,ET.region!$A$51:$M$51,0))","v":5.7362204724409454},{"$f":"INDEX(ET.region!$A$51:$M$61,MATCH(ET.county!$B89,ET.region!$A$51:$A$61,0),MATCH(ET.county!H$1,ET.region!$A$51:$M$51,0))","v":6.3070866141732287},{"$f":"INDEX(ET.region!$A$51:$M$61,MATCH(ET.county!$B89,ET.region!$A$51:$A$61,0),MATCH(ET.county!I$1,ET.region!$A$51:$M$51,0))","v":6.5417322834645679},{"$f":"INDEX(ET.region!$A$51:$M$61,MATCH(ET.county!$B89,ET.region!$A$51:$A$61,0),MATCH(ET.county!J$1,ET.region!$A$51:$M$51,0))","v":5.9314960629921272},{"$f":"INDEX(ET.region!$A$51:$M$61,MATCH(ET.county!$B89,ET.region!$A$51:$A$61,0),MATCH(ET.county!K$1,ET.region!$A$51:$M$51,0))","v":4.5118110236220472},{"$f":"INDEX(ET.region!$A$51:$M$61,MATCH(ET.county!$B89,ET.region!$A$51:$A$61,0),MATCH(ET.county!L$1,ET.region!$A$51:$M$51,0))","v":3.270866141732284},{"$f":"INDEX(ET.region!$A$51:$M$61,MATCH(ET.county!$B89,ET.region!$A$51:$A$61,0),MATCH(ET.county!M$1,ET.region!$A$51:$M$51,0))","v":1.9724409448818898},{"$f":"INDEX(ET.region!$A$51:$M$61,MATCH(ET.county!$B89,ET.region!$A$51:$A$61,0),MATCH(ET.county!N$1,ET.region!$A$51:$M$51,0))","v":1.3547244094488189}]
["Tyrrell","Aurora",{"$f":"INDEX(ET.region!$A$51:$M$61,MATCH(ET.county!$B90,ET.region!$A$51:$A$61,0),MATCH(ET.county!C$1,ET.region!$A$51:$M$51,0))","v":1.581},{"$f":"INDEX(ET.region!$A$51:$M$61,MATCH(ET.county!$B90,ET.region!$A$51:$A$61,0),MATCH(ET.county!D$1,ET.region!$A$51:$M$51,0))","v":1.9600000000000002},{"$f":"INDEX(ET.region!$A$51:$M$61,MATCH(ET.county!$B90,ET.region!$A$51:$A$61,0),MATCH(ET.county!E$1,ET.region!$A$51:$M$51,0))","v":3.2549999999999999},{"$f":"INDEX(ET.region!$A$51:$M$61,MATCH(ET.county!$B90,ET.region!$A$51:$A$61,0),MATCH(ET.county!F$1,ET.region!$A$51:$M$51,0))","v":4.59},{"$f":"INDEX(ET.region!$A$51:$M$61,MATCH(ET.county!$B90,ET.region!$A$51:$A$61,0),MATCH(ET.county!G$1,ET.region!$A$51:$M$51,0))","v":5.7969999999999997},{"$f":"INDEX(ET.region!$A$51:$M$61,MATCH(ET.county!$B90,ET.region!$A$51:$A$61,0),MATCH(ET.county!H$1,ET.region!$A$51:$M$51,0))","v":6.2399999999999993},{"$f":"INDEX(ET.region!$A$51:$M$61,MATCH(ET.county!$B90,ET.region!$A$51:$A$61,0),MATCH(ET.county!I$1,ET.region!$A$51:$M$51,0))","v":6.4790000000000001},{"$f":"INDEX(ET.region!$A$51:$M$61,MATCH(ET.county!$B90,ET.region!$A$51:$A$61,0),MATCH(ET.county!J$1,ET.region!$A$51:$M$51,0))","v":5.7350000000000003},{"$f":"INDEX(ET.region!$A$51:$M$61,MATCH(ET.county!$B90,ET.region!$A$51:$A$61,0),MATCH(ET.county!K$1,ET.region!$A$51:$M$51,0))","v":4.38},{"$f":"INDEX(ET.region!$A$51:$M$61,MATCH(ET.county!$B90,ET.region!$A$51:$A$61,0),MATCH(ET.county!L$1,ET.region!$A$51:$M$51,0))","v":3.2549999999999999},{"$f":"INDEX(ET.region!$A$51:$M$61,MATCH(ET.county!$B90,ET.region!$A$51:$A$61,0),MATCH(ET.county!M$1,ET.region!$A$51:$M$51,0))","v":2.0700000000000003},{"$f":"INDEX(ET.region!$A$51:$M$61,MATCH(ET.county!$B90,ET.region!$A$51:$A$61,0),MATCH(ET.county!N$1,ET.region!$A$51:$M$51,0))","v":1.55}]
["Union ","Salisbury",{"$f":"INDEX(ET.region!$A$51:$M$61,MATCH(ET.county!$B91,ET.region!$A$51:$A$61,0),MATCH(ET.county!C$1,ET.region!$A$51:$M$51,0))","v":1.4889763779527558},{"$f":"INDEX(ET.region!$A$51:$M$61,MATCH(ET.county!$B91,ET.region!$A$51:$A$61,0),MATCH(ET.county!D$1,ET.region!$A$51:$M$51,0))","v":1.9401574803149606},{"$f":"INDEX(ET.region!$A$51:$M$61,MATCH(ET.county!$B91,ET.region!$A$51:$A$61,0),MATCH(ET.county!E$1,ET.region!$A$51:$M$51,0))","v":3.2952755905511819},{"$f":"INDEX(ET.region!$A$51:$M$61,MATCH(ET.county!$B91,ET.region!$A$51:$A$61,0),MATCH(ET.county!F$1,ET.region!$A$51:$M$51,0))","v":4.7007874015748037},{"$f":"INDEX(ET.region!$A$51:$M$61,MATCH(ET.county!$B91,ET.region!$A$51:$A$61,0),MATCH(ET.county!G$1,ET.region!$A$51:$M$51,0))","v":6.0169291338582678},{"$f":"INDEX(ET.region!$A$51:$M$61,MATCH(ET.county!$B91,ET.region!$A$51:$A$61,0),MATCH(ET.county!H$1,ET.region!$A$51:$M$51,0))","v":6.6496062992125982},{"$f":"INDEX(ET.region!$A$51:$M$61,MATCH(ET.county!$B91,ET.region!$A$51:$A$61,0),MATCH(ET.county!I$1,ET.region!$A$51:$M$51,0))","v":6.9322834645669289},{"$f":"INDEX(ET.region!$A$51:$M$61,MATCH(ET.county!$B91,ET.region!$A$51:$A$61,0),MATCH(ET.county!J$1,ET.region!$A$51:$M$51,0))","v":6.1755905511811022},{"$f":"INDEX(ET.region!$A$51:$M$61,MATCH(ET.county!$B91,ET.region!$A$51:$A$61,0),MATCH(ET.county!K$1,ET.region!$A$51:$M$51,0))","v":4.7125984251968509},{"$f":"INDEX(ET.region!$A$51:$M$61,MATCH(ET.county!$B91,ET.region!$A$51:$A$61,0),MATCH(ET.county!L$1,ET.region!$A$51:$M$51,0))","v":3.4173228346456694},{"$f":"INDEX(ET.region!$A$51:$M$61,MATCH(ET.county!$B91,ET.region!$A$51:$A$61,0),MATCH(ET.county!M$1,ET.region!$A$51:$M$51,0))","v":2.1141732283464569},{"$f":"INDEX(ET.region!$A$51:$M$61,MATCH(ET.county!$B91,ET.region!$A$51:$A$61,0),MATCH(ET.county!N$1,ET.region!$A$51:$M$51,0))","v":1.4523622047244096}]
["Vance","Reidsville",{"$f":"INDEX(ET.region!$A$51:$M$61,MATCH(ET.county!$B92,ET.region!$A$51:$A$61,0),MATCH(ET.county!C$1,ET.region!$A$51:$M$51,0))","v":1.3425196850393704},{"$f":"INDEX(ET.region!$A$51:$M$61,MATCH(ET.county!$B92,ET.region!$A$51:$A$61,0),MATCH(ET.county!D$1,ET.region!$A$51:$M$51,0))","v":1.7637795275590555},{"$f":"INDEX(ET.region!$A$51:$M$61,MATCH(ET.county!$B92,ET.region!$A$51:$A$61,0),MATCH(ET.county!E$1,ET.region!$A$51:$M$51,0))","v":3.0877952755905511},{"$f":"INDEX(ET.region!$A$51:$M$61,MATCH(ET.county!$B92,ET.region!$A$51:$A$61,0),MATCH(ET.county!F$1,ET.region!$A$51:$M$51,0))","v":4.4763779527559056},{"$f":"INDEX(ET.region!$A$51:$M$61,MATCH(ET.county!$B92,ET.region!$A$51:$A$61,0),MATCH(ET.county!G$1,ET.region!$A$51:$M$51,0))","v":5.8216535433070868},{"$f":"INDEX(ET.region!$A$51:$M$61,MATCH(ET.county!$B92,ET.region!$A$51:$A$61,0),MATCH(ET.county!H$1,ET.region!$A$51:$M$51,0))","v":6.4842519685039379},{"$f":"INDEX(ET.region!$A$51:$M$61,MATCH(ET.county!$B92,ET.region!$A$51:$A$61,0),MATCH(ET.county!I$1,ET.region!$A$51:$M$51,0))","v":6.8346456692913389},{"$f":"INDEX(ET.region!$A$51:$M$61,MATCH(ET.county!$B92,ET.region!$A$51:$A$61,0),MATCH(ET.county!J$1,ET.region!$A$51:$M$51,0))","v":6.1267716535433072},{"$f":"INDEX(ET.region!$A$51:$M$61,MATCH(ET.county!$B92,ET.region!$A$51:$A$61,0),MATCH(ET.county!K$1,ET.region!$A$51:$M$51,0))","v":4.5826771653543314},{"$f":"INDEX(ET.region!$A$51:$M$61,MATCH(ET.county!$B92,ET.region!$A$51:$A$61,0),MATCH(ET.county!L$1,ET.region!$A$51:$M$51,0))","v":3.246456692913386},{"$f":"INDEX(ET.region!$A$51:$M$61,MATCH(ET.county!$B92,ET.region!$A$51:$A$61,0),MATCH(ET.county!M$1,ET.region!$A$51:$M$51,0))","v":1.9488188976377951},{"$f":"INDEX(ET.region!$A$51:$M$61,MATCH(ET.county!$B92,ET.region!$A$51:$A$61,0),MATCH(ET.county!N$1,ET.region!$A$51:$M$51,0))","v":1.3181102362204726}]
["Wake ","Raleigh",{"$f":"INDEX(ET.region!$A$51:$M$61,MATCH(ET.county!$B93,ET.region!$A$51:$A$61,0),MATCH(ET.county!C$1,ET.region!$A$51:$M$51,0))","v":1.562204724409449},{"$f":"INDEX(ET.region!$A$51:$M$61,MATCH(ET.county!$B93,ET.region!$A$51:$A$61,0),MATCH(ET.county!D$1,ET.region!$A$51:$M$51,0))","v":2.0503937007874016},{"$f":"INDEX(ET.region!$A$51:$M$61,MATCH(ET.county!$B93,ET.region!$A$51:$A$61,0),MATCH(ET.county!E$1,ET.region!$A$51:$M$51,0))","v":3.5027559055118114},{"$f":"INDEX(ET.region!$A$51:$M$61,MATCH(ET.county!$B93,ET.region!$A$51:$A$61,0),MATCH(ET.county!F$1,ET.region!$A$51:$M$51,0))","v":4.9370078740157481},{"$f":"INDEX(ET.region!$A$51:$M$61,MATCH(ET.county!$B93,ET.region!$A$51:$A$61,0),MATCH(ET.county!G$1,ET.region!$A$51:$M$51,0))","v":6.2122047244094487},{"$f":"INDEX(ET.region!$A$51:$M$61,MATCH(ET.county!$B93,ET.region!$A$51:$A$61,0),MATCH(ET.county!H$1,ET.region!$A$51:$M$51,0))","v":6.6968503937007879},{"$f":"INDEX(ET.region!$A$51:$M$61,MATCH(ET.county!$B93,ET.region!$A$51:$A$61,0),MATCH(ET.county!I$1,ET.region!$A$51:$M$51,0))","v":6.9444881889763792},{"$f":"INDEX(ET.region!$A$51:$M$61,MATCH(ET.county!$B93,ET.region!$A$51:$A$61,0),MATCH(ET.county!J$1,ET.region!$A$51:$M$51,0))","v":6.2122047244094487},{"$f":"INDEX(ET.region!$A$51:$M$61,MATCH(ET.county!$B93,ET.region!$A$51:$A$61,0),MATCH(ET.county!K$1,ET.region!$A$51:$M$51,0))","v":4.7598425196850407},{"$f":"INDEX(ET.region!$A$51:$M$61,MATCH(ET.county!$B93,ET.region!$A$51:$A$61,0),MATCH(ET.county!L$1,ET.region!$A$51:$M$51,0))","v":3.4417322834645669},{"$f":"INDEX(ET.region!$A$51:$M$61,MATCH(ET.county!$B93,ET.region!$A$51:$A$61,0),MATCH(ET.county!M$1,ET.region!$A$51:$M$51,0))","v":2.1496062992125986},{"$f":"INDEX(ET.region!$A$51:$M$61,MATCH(ET.county!$B93,ET.region!$A$51:$A$61,0),MATCH(ET.county!N$1,ET.region!$A$51:$M$51,0))","v":1.5133858267716536}]
["Warren ","Lewiston",{"$f":"INDEX(ET.region!$A$51:$M$61,MATCH(ET.county!$B94,ET.region!$A$51:$A$61,0),MATCH(ET.county!C$1,ET.region!$A$51:$M$51,0))","v":1.5255905511811025},{"$f":"INDEX(ET.region!$A$51:$M$61,MATCH(ET.county!$B94,ET.region!$A$51:$A$61,0),MATCH(ET.county!D$1,ET.region!$A$51:$M$51,0))","v":2.0173228346456695},{"$f":"INDEX(ET.region!$A$51:$M$61,MATCH(ET.county!$B94,ET.region!$A$51:$A$61,0),MATCH(ET.county!E$1,ET.region!$A$51:$M$51,0))","v":3.4905511811023624},{"$f":"INDEX(ET.region!$A$51:$M$61,MATCH(ET.county!$B94,ET.region!$A$51:$A$61,0),MATCH(ET.county!F$1,ET.region!$A$51:$M$51,0))","v":5.0551181102362204},{"$f":"INDEX(ET.region!$A$51:$M$61,MATCH(ET.county!$B94,ET.region!$A$51:$A$61,0),MATCH(ET.county!G$1,ET.region!$A$51:$M$51,0))","v":6.4318897637795267},{"$f":"INDEX(ET.region!$A$51:$M$61,MATCH(ET.county!$B94,ET.region!$A$51:$A$61,0),MATCH(ET.county!H$1,ET.region!$A$51:$M$51,0))","v":7.0748031496063},{"$f":"INDEX(ET.region!$A$51:$M$61,MATCH(ET.county!$B94,ET.region!$A$51:$A$61,0),MATCH(ET.county!I$1,ET.region!$A$51:$M$51,0))","v":7.359448818897639},{"$f":"INDEX(ET.region!$A$51:$M$61,MATCH(ET.county!$B94,ET.region!$A$51:$A$61,0),MATCH(ET.county!J$1,ET.region!$A$51:$M$51,0))","v":6.566141732283465},{"$f":"INDEX(ET.region!$A$51:$M$61,MATCH(ET.county!$B94,ET.region!$A$51:$A$61,0),MATCH(ET.county!K$1,ET.region!$A$51:$M$51,0))","v":4.9488188976377963},{"$f":"INDEX(ET.region!$A$51:$M$61,MATCH(ET.county!$B94,ET.region!$A$51:$A$61,0),MATCH(ET.county!L$1,ET.region!$A$51:$M$51,0))","v":3.5759842519685043},{"$f":"INDEX(ET.region!$A$51:$M$61,MATCH(ET.county!$B94,ET.region!$A$51:$A$61,0),MATCH(ET.county!M$1,ET.region!$A$51:$M$51,0))","v":2.1968503937007875},{"$f":"INDEX(ET.region!$A$51:$M$61,MATCH(ET.county!$B94,ET.region!$A$51:$A$61,0),MATCH(ET.county!N$1,ET.region!$A$51:$M$51,0))","v":1.5255905511811025}]
["Washington ","Aurora",{"$f":"INDEX(ET.region!$A$51:$M$61,MATCH(ET.county!$B95,ET.region!$A$51:$A$61,0),MATCH(ET.county!C$1,ET.region!$A$51:$M$51,0))","v":1.581},{"$f":"INDEX(ET.region!$A$51:$M$61,MATCH(ET.county!$B95,ET.region!$A$51:$A$61,0),MATCH(ET.county!D$1,ET.region!$A$51:$M$51,0))","v":1.9600000000000002},{"$f":"INDEX(ET.region!$A$51:$M$61,MATCH(ET.county!$B95,ET.region!$A$51:$A$61,0),MATCH(ET.county!E$1,ET.region!$A$51:$M$51,0))","v":3.2549999999999999},{"$f":"INDEX(ET.region!$A$51:$M$61,MATCH(ET.county!$B95,ET.region!$A$51:$A$61,0),MATCH(ET.county!F$1,ET.region!$A$51:$M$51,0))","v":4.59},{"$f":"INDEX(ET.region!$A$51:$M$61,MATCH(ET.county!$B95,ET.region!$A$51:$A$61,0),MATCH(ET.county!G$1,ET.region!$A$51:$M$51,0))","v":5.7969999999999997},{"$f":"INDEX(ET.region!$A$51:$M$61,MATCH(ET.county!$B95,ET.region!$A$51:$A$61,0),MATCH(ET.county!H$1,ET.region!$A$51:$M$51,0))","v":6.2399999999999993},{"$f":"INDEX(ET.region!$A$51:$M$61,MATCH(ET.county!$B95,ET.region!$A$51:$A$61,0),MATCH(ET.county!I$1,ET.region!$A$51:$M$51,0))","v":6.4790000000000001},{"$f":"INDEX(ET.region!$A$51:$M$61,MATCH(ET.county!$B95,ET.region!$A$51:$A$61,0),MATCH(ET.county!J$1,ET.region!$A$51:$M$51,0))","v":5.7350000000000003},{"$f":"INDEX(ET.region!$A$51:$M$61,MATCH(ET.county!$B95,ET.region!$A$51:$A$61,0),MATCH(ET.county!K$1,ET.region!$A$51:$M$51,0))","v":4.38},{"$f":"INDEX(ET.region!$A$51:$M$61,MATCH(ET.county!$B95,ET.region!$A$51:$A$61,0),MATCH(ET.county!L$1,ET.region!$A$51:$M$51,0))","v":3.2549999999999999},{"$f":"INDEX(ET.region!$A$51:$M$61,MATCH(ET.county!$B95,ET.region!$A$51:$A$61,0),MATCH(ET.county!M$1,ET.region!$A$51:$M$51,0))","v":2.0700000000000003},{"$f":"INDEX(ET.region!$A$51:$M$61,MATCH(ET.county!$B95,ET.region!$A$51:$A$61,0),MATCH(ET.county!N$1,ET.region!$A$51:$M$51,0))","v":1.55}]
["Watauga ","Fletcher",{"$f":"INDEX(ET.region!$A$51:$M$61,MATCH(ET.county!$B96,ET.region!$A$51:$A$61,0),MATCH(ET.county!C$1,ET.region!$A$51:$M$51,0))","v":1.3913385826771654},{"$f":"INDEX(ET.region!$A$51:$M$61,MATCH(ET.county!$B96,ET.region!$A$51:$A$61,0),MATCH(ET.county!D$1,ET.region!$A$51:$M$51,0))","v":1.7748031496062995},{"$f":"INDEX(ET.region!$A$51:$M$61,MATCH(ET.county!$B96,ET.region!$A$51:$A$61,0),MATCH(ET.county!E$1,ET.region!$A$51:$M$51,0))","v":3.0633858267716536},{"$f":"INDEX(ET.region!$A$51:$M$61,MATCH(ET.county!$B96,ET.region!$A$51:$A$61,0),MATCH(ET.county!F$1,ET.region!$A$51:$M$51,0))","v":4.4173228346456694},{"$f":"INDEX(ET.region!$A$51:$M$61,MATCH(ET.county!$B96,ET.region!$A$51:$A$61,0),MATCH(ET.county!G$1,ET.region!$A$51:$M$51,0))","v":5.7362204724409454},{"$f":"INDEX(ET.region!$A$51:$M$61,MATCH(ET.county!$B96,ET.region!$A$51:$A$61,0),MATCH(ET.county!H$1,ET.region!$A$51:$M$51,0))","v":6.3070866141732287},{"$f":"INDEX(ET.region!$A$51:$M$61,MATCH(ET.county!$B96,ET.region!$A$51:$A$61,0),MATCH(ET.county!I$1,ET.region!$A$51:$M$51,0))","v":6.5417322834645679},{"$f":"INDEX(ET.region!$A$51:$M$61,MATCH(ET.county!$B96,ET.region!$A$51:$A$61,0),MATCH(ET.county!J$1,ET.region!$A$51:$M$51,0))","v":5.9314960629921272},{"$f":"INDEX(ET.region!$A$51:$M$61,MATCH(ET.county!$B96,ET.region!$A$51:$A$61,0),MATCH(ET.county!K$1,ET.region!$A$51:$M$51,0))","v":4.5118110236220472},{"$f":"INDEX(ET.region!$A$51:$M$61,MATCH(ET.county!$B96,ET.region!$A$51:$A$61,0),MATCH(ET.county!L$1,ET.region!$A$51:$M$51,0))","v":3.270866141732284},{"$f":"INDEX(ET.region!$A$51:$M$61,MATCH(ET.county!$B96,ET.region!$A$51:$A$61,0),MATCH(ET.county!M$1,ET.region!$A$51:$M$51,0))","v":1.9724409448818898},{"$f":"INDEX(ET.region!$A$51:$M$61,MATCH(ET.county!$B96,ET.region!$A$51:$A$61,0),MATCH(ET.county!N$1,ET.region!$A$51:$M$51,0))","v":1.3547244094488189}]
["Wayne","Goldsboro",{"$f":"INDEX(ET.region!$A$51:$M$61,MATCH(ET.county!$B97,ET.region!$A$51:$A$61,0),MATCH(ET.county!C$1,ET.region!$A$51:$M$51,0))","v":1.5744094488188978},{"$f":"INDEX(ET.region!$A$51:$M$61,MATCH(ET.county!$B97,ET.region!$A$51:$A$61,0),MATCH(ET.county!D$1,ET.region!$A$51:$M$51,0))","v":2.0173228346456695},{"$f":"INDEX(ET.region!$A$51:$M$61,MATCH(ET.county!$B97,ET.region!$A$51:$A$61,0),MATCH(ET.county!E$1,ET.region!$A$51:$M$51,0))","v":3.4661417322834644},{"$f":"INDEX(ET.region!$A$51:$M$61,MATCH(ET.county!$B97,ET.region!$A$51:$A$61,0),MATCH(ET.county!F$1,ET.region!$A$51:$M$51,0))","v":4.877952755905512},{"$f":"INDEX(ET.region!$A$51:$M$61,MATCH(ET.county!$B97,ET.region!$A$51:$A$61,0),MATCH(ET.county!G$1,ET.region!$A$51:$M$51,0))","v":6.2976377952755911},{"$f":"INDEX(ET.region!$A$51:$M$61,MATCH(ET.county!$B97,ET.region!$A$51:$A$61,0),MATCH(ET.county!H$1,ET.region!$A$51:$M$51,0))","v":6.6968503937007879},{"$f":"INDEX(ET.region!$A$51:$M$61,MATCH(ET.county!$B97,ET.region!$A$51:$A$61,0),MATCH(ET.county!I$1,ET.region!$A$51:$M$51,0))","v":6.8346456692913389},{"$f":"INDEX(ET.region!$A$51:$M$61,MATCH(ET.county!$B97,ET.region!$A$51:$A$61,0),MATCH(ET.county!J$1,ET.region!$A$51:$M$51,0))","v":6.1145669291338578},{"$f":"INDEX(ET.region!$A$51:$M$61,MATCH(ET.county!$B97,ET.region!$A$51:$A$61,0),MATCH(ET.county!K$1,ET.region!$A$51:$M$51,0))","v":4.7125984251968509},{"$f":"INDEX(ET.region!$A$51:$M$61,MATCH(ET.county!$B97,ET.region!$A$51:$A$61,0),MATCH(ET.county!L$1,ET.region!$A$51:$M$51,0))","v":3.4661417322834644},{"$f":"INDEX(ET.region!$A$51:$M$61,MATCH(ET.county!$B97,ET.region!$A$51:$A$61,0),MATCH(ET.county!M$1,ET.region!$A$51:$M$51,0))","v":2.1968503937007875},{"$f":"INDEX(ET.region!$A$51:$M$61,MATCH(ET.county!$B97,ET.region!$A$51:$A$61,0),MATCH(ET.county!N$1,ET.region!$A$51:$M$51,0))","v":1.55}]
["Wilkes ","Lenoir",{"$f":"INDEX(ET.region!$A$51:$M$61,MATCH(ET.county!$B98,ET.region!$A$51:$A$61,0),MATCH(ET.county!C$1,ET.region!$A$51:$M$51,0))","v":1.4523622047244096},{"$f":"INDEX(ET.region!$A$51:$M$61,MATCH(ET.county!$B98,ET.region!$A$51:$A$61,0),MATCH(ET.county!D$1,ET.region!$A$51:$M$51,0))","v":1.8850393700787402},{"$f":"INDEX(ET.region!$A$51:$M$61,MATCH(ET.county!$B98,ET.region!$A$51:$A$61,0),MATCH(ET.county!E$1,ET.region!$A$51:$M$51,0))","v":3.1610236220472441},{"$f":"INDEX(ET.region!$A$51:$M$61,MATCH(ET.county!$B98,ET.region!$A$51:$A$61,0),MATCH(ET.county!F$1,ET.region!$A$51:$M$51,0))","v":4.346456692913387},{"$f":"INDEX(ET.region!$A$51:$M$61,MATCH(ET.county!$B98,ET.region!$A$51:$A$61,0),MATCH(ET.county!G$1,ET.region!$A$51:$M$51,0))","v":5.333464566929135},{"$f":"INDEX(ET.region!$A$51:$M$61,MATCH(ET.county!$B98,ET.region!$A$51:$A$61,0),MATCH(ET.county!H$1,ET.region!$A$51:$M$51,0))","v":5.5748031496062991},{"$f":"INDEX(ET.region!$A$51:$M$61,MATCH(ET.county!$B98,ET.region!$A$51:$A$61,0),MATCH(ET.county!I$1,ET.region!$A$51:$M$51,0))","v":5.6751968503937018},{"$f":"INDEX(ET.region!$A$51:$M$61,MATCH(ET.county!$B98,ET.region!$A$51:$A$61,0),MATCH(ET.county!J$1,ET.region!$A$51:$M$51,0))","v":5.0893700787401581},{"$f":"INDEX(ET.region!$A$51:$M$61,MATCH(ET.county!$B98,ET.region!$A$51:$A$61,0),MATCH(ET.county!K$1,ET.region!$A$51:$M$51,0))","v":4.015748031496063},{"$f":"INDEX(ET.region!$A$51:$M$61,MATCH(ET.county!$B98,ET.region!$A$51:$A$61,0),MATCH(ET.county!L$1,ET.region!$A$51:$M$51,0))","v":3.0633858267716536},{"$f":"INDEX(ET.region!$A$51:$M$61,MATCH(ET.county!$B98,ET.region!$A$51:$A$61,0),MATCH(ET.county!M$1,ET.region!$A$51:$M$51,0))","v":1.9606299212598426},{"$f":"INDEX(ET.region!$A$51:$M$61,MATCH(ET.county!$B98,ET.region!$A$51:$A$61,0),MATCH(ET.county!N$1,ET.region!$A$51:$M$51,0))","v":1.3913385826771654}]
["Wilson ","Goldsboro",{"$f":"INDEX(ET.region!$A$51:$M$61,MATCH(ET.county!$B99,ET.region!$A$51:$A$61,0),MATCH(ET.county!C$1,ET.region!$A$51:$M$51,0))","v":1.5744094488188978},{"$f":"INDEX(ET.region!$A$51:$M$61,MATCH(ET.county!$B99,ET.region!$A$51:$A$61,0),MATCH(ET.county!D$1,ET.region!$A$51:$M$51,0))","v":2.0173228346456695},{"$f":"INDEX(ET.region!$A$51:$M$61,MATCH(ET.county!$B99,ET.region!$A$51:$A$61,0),MATCH(ET.county!E$1,ET.region!$A$51:$M$51,0))","v":3.4661417322834644},{"$f":"INDEX(ET.region!$A$51:$M$61,MATCH(ET.county!$B99,ET.region!$A$51:$A$61,0),MATCH(ET.county!F$1,ET.region!$A$51:$M$51,0))","v":4.877952755905512},{"$f":"INDEX(ET.region!$A$51:$M$61,MATCH(ET.county!$B99,ET.region!$A$51:$A$61,0),MATCH(ET.county!G$1,ET.region!$A$51:$M$51,0))","v":6.2976377952755911},{"$f":"INDEX(ET.region!$A$51:$M$61,MATCH(ET.county!$B99,ET.region!$A$51:$A$61,0),MATCH(ET.county!H$1,ET.region!$A$51:$M$51,0))","v":6.6968503937007879},{"$f":"INDEX(ET.region!$A$51:$M$61,MATCH(ET.county!$B99,ET.region!$A$51:$A$61,0),MATCH(ET.county!I$1,ET.region!$A$51:$M$51,0))","v":6.8346456692913389},{"$f":"INDEX(ET.region!$A$51:$M$61,MATCH(ET.county!$B99,ET.region!$A$51:$A$61,0),MATCH(ET.county!J$1,ET.region!$A$51:$M$51,0))","v":6.1145669291338578},{"$f":"INDEX(ET.region!$A$51:$M$61,MATCH(ET.county!$B99,ET.region!$A$51:$A$61,0),MATCH(ET.county!K$1,ET.region!$A$51:$M$51,0))","v":4.7125984251968509},{"$f":"INDEX(ET.region!$A$51:$M$61,MATCH(ET.county!$B99,ET.region!$A$51:$A$61,0),MATCH(ET.county!L$1,ET.region!$A$51:$M$51,0))","v":3.4661417322834644},{"$f":"INDEX(ET.region!$A$51:$M$61,MATCH(ET.county!$B99,ET.region!$A$51:$A$61,0),MATCH(ET.county!M$1,ET.region!$A$51:$M$51,0))","v":2.1968503937007875},{"$f":"INDEX(ET.region!$A$51:$M$61,MATCH(ET.county!$B99,ET.region!$A$51:$A$61,0),MATCH(ET.county!N$1,ET.region!$A$51:$M$51,0))","v":1.55}]
["Yadkin ","Reidsville",{"$f":"INDEX(ET.region!$A$51:$M$61,MATCH(ET.county!$B100,ET.region!$A$51:$A$61,0),MATCH(ET.county!C$1,ET.region!$A$51:$M$51,0))","v":1.3425196850393704},{"$f":"INDEX(ET.region!$A$51:$M$61,MATCH(ET.county!$B100,ET.region!$A$51:$A$61,0),MATCH(ET.county!D$1,ET.region!$A$51:$M$51,0))","v":1.7637795275590555},{"$f":"INDEX(ET.region!$A$51:$M$61,MATCH(ET.county!$B100,ET.region!$A$51:$A$61,0),MATCH(ET.county!E$1,ET.region!$A$51:$M$51,0))","v":3.0877952755905511},{"$f":"INDEX(ET.region!$A$51:$M$61,MATCH(ET.county!$B100,ET.region!$A$51:$A$61,0),MATCH(ET.county!F$1,ET.region!$A$51:$M$51,0))","v":4.4763779527559056},{"$f":"INDEX(ET.region!$A$51:$M$61,MATCH(ET.county!$B100,ET.region!$A$51:$A$61,0),MATCH(ET.county!G$1,ET.region!$A$51:$M$51,0))","v":5.8216535433070868},{"$f":"INDEX(ET.region!$A$51:$M$61,MATCH(ET.county!$B100,ET.region!$A$51:$A$61,0),MATCH(ET.county!H$1,ET.region!$A$51:$M$51,0))","v":6.4842519685039379},{"$f":"INDEX(ET.region!$A$51:$M$61,MATCH(ET.county!$B100,ET.region!$A$51:$A$61,0),MATCH(ET.county!I$1,ET.region!$A$51:$M$51,0))","v":6.8346456692913389},{"$f":"INDEX(ET.region!$A$51:$M$61,MATCH(ET.county!$B100,ET.region!$A$51:$A$61,0),MATCH(ET.county!J$1,ET.region!$A$51:$M$51,0))","v":6.1267716535433072},{"$f":"INDEX(ET.region!$A$51:$M$61,MATCH(ET.county!$B100,ET.region!$A$51:$A$61,0),MATCH(ET.county!K$1,ET.region!$A$51:$M$51,0))","v":4.5826771653543314},{"$f":"INDEX(ET.region!$A$51:$M$61,MATCH(ET.county!$B100,ET.region!$A$51:$A$61,0),MATCH(ET.county!L$1,ET.region!$A$51:$M$51,0))","v":3.246456692913386},{"$f":"INDEX(ET.region!$A$51:$M$61,MATCH(ET.county!$B100,ET.region!$A$51:$A$61,0),MATCH(ET.county!M$1,ET.region!$A$51:$M$51,0))","v":1.9488188976377951},{"$f":"INDEX(ET.region!$A$51:$M$61,MATCH(ET.county!$B100,ET.region!$A$51:$A$61,0),MATCH(ET.county!N$1,ET.region!$A$51:$M$51,0))","v":1.3181102362204726}]
["Yancey ","Fletcher",{"$f":"INDEX(ET.region!$A$51:$M$61,MATCH(ET.county!$B101,ET.region!$A$51:$A$61,0),MATCH(ET.county!C$1,ET.region!$A$51:$M$51,0))","v":1.3913385826771654},{"$f":"INDEX(ET.region!$A$51:$M$61,MATCH(ET.county!$B101,ET.region!$A$51:$A$61,0),MATCH(ET.county!D$1,ET.region!$A$51:$M$51,0))","v":1.7748031496062995},{"$f":"INDEX(ET.region!$A$51:$M$61,MATCH(ET.county!$B101,ET.region!$A$51:$A$61,0),MATCH(ET.county!E$1,ET.region!$A$51:$M$51,0))","v":3.0633858267716536},{"$f":"INDEX(ET.region!$A$51:$M$61,MATCH(ET.county!$B101,ET.region!$A$51:$A$61,0),MATCH(ET.county!F$1,ET.region!$A$51:$M$51,0))","v":4.4173228346456694},{"$f":"INDEX(ET.region!$A$51:$M$61,MATCH(ET.county!$B101,ET.region!$A$51:$A$61,0),MATCH(ET.county!G$1,ET.region!$A$51:$M$51,0))","v":5.7362204724409454},{"$f":"INDEX(ET.region!$A$51:$M$61,MATCH(ET.county!$B101,ET.region!$A$51:$A$61,0),MATCH(ET.county!H$1,ET.region!$A$51:$M$51,0))","v":6.3070866141732287},{"$f":"INDEX(ET.region!$A$51:$M$61,MATCH(ET.county!$B101,ET.region!$A$51:$A$61,0),MATCH(ET.county!I$1,ET.region!$A$51:$M$51,0))","v":6.5417322834645679},{"$f":"INDEX(ET.region!$A$51:$M$61,MATCH(ET.county!$B101,ET.region!$A$51:$A$61,0),MATCH(ET.county!J$1,ET.region!$A$51:$M$51,0))","v":5.9314960629921272},{"$f":"INDEX(ET.region!$A$51:$M$61,MATCH(ET.county!$B101,ET.region!$A$51:$A$61,0),MATCH(ET.county!K$1,ET.region!$A$51:$M$51,0))","v":4.5118110236220472},{"$f":"INDEX(ET.region!$A$51:$M$61,MATCH(ET.county!$B101,ET.region!$A$51:$A$61,0),MATCH(ET.county!L$1,ET.region!$A$51:$M$51,0))","v":3.270866141732284},{"$f":"INDEX(ET.region!$A$51:$M$61,MATCH(ET.county!$B101,ET.region!$A$51:$A$61,0),MATCH(ET.county!M$1,ET.region!$A$51:$M$51,0))","v":1.9724409448818898},{"$f":"INDEX(ET.region!$A$51:$M$61,MATCH(ET.county!$B101,ET.region!$A$51:$A$61,0),MATCH(ET.county!N$1,ET.region!$A$51:$M$51,0))","v":1.3547244094488189}]

{"sheet":"ET.region","index":7,"n_rows":61,"n_cols":15,"rows_kept":61,"cut":false,"hidden":false,"merged":[]}
["Region",1,2,3,4,5,6,7,8,9,10," "]
[null,"Harg.Eto","Harg.Eto","Harg.Eto","Harg.Eto","Harg.Eto","Harg.Eto","Harg.Eto","Harg.Eto","Harg.Eto","Harg.Eto"]
[" ","Aurora","Lewiston","Goldsboro","Whiteville","Raleigh","Jackson.Springs","Reidsville","Salisbury","Lenoir","Fletcher",null,null,"Month","Days/mo."]
[1,5.0999999999999997E-2,4.9212598425196853E-2,5.0787401574803152E-2,5.4724409448818893E-2,5.0393700787401581E-2,4.8425196850393704E-2,4.3307086614173235E-2,4.8031496062992125E-2,4.6850393700787404E-2,4.4881889763779527E-2,null,null,1,31]
[2,7.0000000000000007E-2,7.2047244094488191E-2,7.2047244094488191E-2,7.6771653543307089E-2,7.3228346456692919E-2,7.0078740157480321E-2,6.2992125984251982E-2,6.9291338582677164E-2,6.7322834645669294E-2,6.3385826771653553E-2,null,null,2,28]
[3,0.105,0.1125984251968504,0.11181102362204724,0.11692913385826773,0.11299212598425198,0.10984251968503937,9.960629921259842E-2,0.10629921259842522,0.10196850393700788,9.8818897637795278E-2,null,null,3,31]
[4,0.153,0.16850393700787403,0.16259842519685039,0.16574803149606299,0.16456692913385826,0.16220472440944883,0.14921259842519685,0.15669291338582678,0.14488188976377955,0.14724409448818898,null,null,4,30]
[5,0.187,0.20748031496062991,0.20314960629921261,0.20314960629921261,0.20039370078740157,0.19921259842519684,0.18779527559055118,0.19409448818897637,0.17204724409448821,0.18503937007874016,null,null,5,31]
[6,0.20799999999999999,0.23582677165354332,0.22322834645669293,0.22047244094488189,0.22322834645669293,0.22480314960629921,0.21614173228346459,0.22165354330708661,0.1858267716535433,0.21023622047244095,null,null,6,30]
[7,0.20899999999999999,0.23740157480314963,0.22047244094488189,0.22125984251968506,0.2240157480314961,0.22598425196850397,0.22047244094488189,0.22362204724409449,0.18307086614173232,0.21102362204724412,null,null,7,31]
[8,0.185,0.21181102362204726,0.19724409448818897,0.19921259842519684,0.20039370078740157,0.20078740157480315,0.19763779527559056,0.19921259842519684,0.1641732283464567,0.19133858267716539,null,null,8,31]
[9,0.14599999999999999,0.16496062992125987,0.15708661417322836,0.16220472440944883,0.15866141732283467,0.15905511811023623,0.15275590551181104,0.15708661417322836,0.13385826771653545,0.15039370078740158,null,null,9,30]
[10,0.105,0.11535433070866143,0.11181102362204724,0.1173228346456693,0.1110236220472441,0.10984251968503937,0.1047244094488189,0.11023622047244094,9.8818897637795278E-2,0.10551181102362206,null,null,10,31]
[11,6.9000000000000006E-2,7.3228346456692919E-2,7.3228346456692919E-2,7.874015748031496E-2,7.165354330708662E-2,6.968503937007875E-2,6.4960629921259838E-2,7.0472440944881892E-2,6.5354330708661423E-2,6.5748031496062995E-2,null,null,11,30]
[12,0.05,4.9212598425196853E-2,0.05,5.4330708661417322E-2,4.8818897637795275E-2,4.8031496062992125E-2,4.2519685039370085E-2,4.6850393700787404E-2,4.4881889763779527E-2,4.3700787401574806E-2,null,null,12,31]
["Monthly Total, in."]
["Region",1,2,3,4,5,6,7,8,9,10]
[null,"Harg.Eto","Harg.Eto","Harg.Eto","Harg.Eto","Harg.Eto","Harg.Eto","Harg.Eto","Harg.Eto","Harg.Eto","Harg.Eto"]
[" ","Aurora","Lewiston","Goldsboro","Whiteville","Raleigh","Jackson.Springs","Reidsville","Salisbury","Lenoir","Fletcher"]
[1,{"$f":"+B4*VLOOKUP($A20,$N$4:$O$15,2)","v":1.581},{"$f":"+C4*VLOOKUP($A20,$N$4:$O$15,2)","v":1.5255905511811025},1.5744094488188978,1.6964566929133857,1.562204724409449,1.5011811023622048,1.3425196850393704,1.4889763779527558,1.4523622047244096,1.3913385826771654]
[2,{"$f":"+B5*VLOOKUP($A21,$N$4:$O$15,2)","v":1.9600000000000002},2.0173228346456695,2.0173228346456695,2.1496062992125986,2.0503937007874016,1.9622047244094489,1.7637795275590555,1.9401574803149606,1.8850393700787402,1.7748031496062995]
[3,3.2549999999999999,3.4905511811023624,3.4661417322834644,3.6248031496062993,3.5027559055118114,3.4051181102362205,3.0877952755905511,3.2952755905511819,3.1610236220472441,3.0633858267716536]
[4,4.59,5.0551181102362204,4.877952755905512,4.9724409448818898,4.9370078740157481,4.8661417322834648,4.4763779527559056,4.7007874015748037,4.346456692913387,4.4173228346456694]
[5,5.7969999999999997,6.4318897637795267,6.2976377952755911,6.2976377952755911,6.2122047244094487,6.1755905511811022,5.8216535433070868,6.0169291338582678,5.333464566929135,5.7362204724409454]
[6,6.2399999999999993,7.0748031496063,6.6968503937007879,6.6141732283464565,6.6968503937007879,6.7440944881889759,6.4842519685039379,6.6496062992125982,5.5748031496062991,6.3070866141732287]
[7,6.4790000000000001,7.359448818897639,6.8346456692913389,6.8590551181102368,6.9444881889763792,7.0055118110236227,6.8346456692913389,6.9322834645669289,5.6751968503937018,6.5417322834645679]
[8,5.7350000000000003,6.566141732283465,6.1145669291338578,6.1755905511811022,6.2122047244094487,6.2244094488188981,6.1267716535433072,6.1755905511811022,5.0893700787401581,5.9314960629921272]
[9,4.38,4.9488188976377963,4.7125984251968509,4.8661417322834648,4.7598425196850407,4.771653543307087,4.5826771653543314,4.7125984251968509,4.015748031496063,4.5118110236220472]
[10,3.2549999999999999,3.5759842519685043,3.4661417322834644,3.6370078740157483,3.4417322834645669,3.4051181102362205,3.246456692913386,3.4173228346456694,3.0633858267716536,3.270866141732284]
[11,2.0700000000000003,2.1968503937007875,2.1968503937007875,2.3622047244094486,2.1496062992125986,2.0905511811023625,1.9488188976377951,2.1141732283464569,1.9606299212598426,1.9724409448818898]
[12,1.55,1.5255905511811025,1.55,1.684251968503937,1.5133858267716536,1.4889763779527558,1.3181102362204726,1.4523622047244096,1.3913385826771654,1.3547244094488189]
["Values"]
["Region",1,2,3,4,5,6,7,8,9,10]
[null,"Harg.Eto","Harg.Eto","Harg.Eto","Harg.Eto","Harg.Eto","Harg.Eto","Harg.Eto","Harg.Eto","Harg.Eto","Harg.Eto"]
[" ","Aurora","Lewiston","Goldsboro","Whiteville","Raleigh","Jackson.Springs","Reidsville","Salisbury","Lenoir","Fletcher"]
[1,1.581,1.5255905511811025,1.5744094488188978,1.6964566929133857,1.562204724409449,1.5011811023622048,1.3425196850393704,1.4889763779527558,1.4523622047244096,1.3913385826771654]
[2,1.9600000000000002,2.0173228346456695,2.0173228346456695,2.1496062992125986,2.0503937007874016,1.9622047244094489,1.7637795275590555,1.9401574803149606,1.8850393700787402,1.7748031496062995]
[3,3.2549999999999999,3.4905511811023624,3.4661417322834644,3.6248031496062993,3.5027559055118114,3.4051181102362205,3.0877952755905511,3.2952755905511819,3.1610236220472441,3.0633858267716536]
[4,4.59,5.0551181102362204,4.877952755905512,4.9724409448818898,4.9370078740157481,4.8661417322834648,4.4763779527559056,4.7007874015748037,4.346456692913387,4.4173228346456694]
[5,5.7969999999999997,6.4318897637795267,6.2976377952755911,6.2976377952755911,6.2122047244094487,6.1755905511811022,5.8216535433070868,6.0169291338582678,5.333464566929135,5.7362204724409454]
[6,6.2399999999999993,7.0748031496063,6.6968503937007879,6.6141732283464565,6.6968503937007879,6.7440944881889759,6.4842519685039379,6.6496062992125982,5.5748031496062991,6.3070866141732287]
[7,6.4790000000000001,7.359448818897639,6.8346456692913389,6.8590551181102368,6.9444881889763792,7.0055118110236227,6.8346456692913389,6.9322834645669289,5.6751968503937018,6.5417322834645679]
[8,5.7350000000000003,6.566141732283465,6.1145669291338578,6.1755905511811022,6.2122047244094487,6.2244094488188981,6.1267716535433072,6.1755905511811022,5.0893700787401581,5.9314960629921272]
[9,4.38,4.9488188976377963,4.7125984251968509,4.8661417322834648,4.7598425196850407,4.771653543307087,4.5826771653543314,4.7125984251968509,4.015748031496063,4.5118110236220472]
[10,3.2549999999999999,3.5759842519685043,3.4661417322834644,3.6370078740157483,3.4417322834645669,3.4051181102362205,3.246456692913386,3.4173228346456694,3.0633858267716536,3.270866141732284]
[11,2.0700000000000003,2.1968503937007875,2.1968503937007875,2.3622047244094486,2.1496062992125986,2.0905511811023625,1.9488188976377951,2.1141732283464569,1.9606299212598426,1.9724409448818898]
[12,1.55,1.5255905511811025,1.55,1.684251968503937,1.5133858267716536,1.4889763779527558,1.3181102362204726,1.4523622047244096,1.3913385826771654,1.3547244094488189]
[]
["Transposed"]
["Region"]
[" ",1,2,3,4,5,6,7,8,9,10,11,12]
["Aurora",1.581,1.9600000000000002,3.2549999999999999,4.59,5.7969999999999997,6.2399999999999993,6.4790000000000001,5.7350000000000003,4.38,3.2549999999999999,2.0700000000000003,1.55]
["Lewiston",1.5255905511811025,2.0173228346456695,3.4905511811023624,5.0551181102362204,6.4318897637795267,7.0748031496063,7.359448818897639,6.566141732283465,4.9488188976377963,3.5759842519685043,2.1968503937007875,1.5255905511811025]
["Goldsboro",1.5744094488188978,2.0173228346456695,3.4661417322834644,4.877952755905512,6.2976377952755911,6.6968503937007879,6.8346456692913389,6.1145669291338578,4.7125984251968509,3.4661417322834644,2.1968503937007875,1.55]
["Whiteville",1.6964566929133857,2.1496062992125986,3.6248031496062993,4.9724409448818898,6.2976377952755911,6.6141732283464565,6.8590551181102368,6.1755905511811022,4.8661417322834648,3.6370078740157483,2.3622047244094486,1.684251968503937]
["Raleigh",1.562204724409449,2.0503937007874016,3.5027559055118114,4.9370078740157481,6.2122047244094487,6.6968503937007879,6.9444881889763792,6.2122047244094487,4.7598425196850407,3.4417322834645669,2.1496062992125986,1.5133858267716536]
["Jackson.Springs",1.5011811023622048,1.9622047244094489,3.4051181102362205,4.8661417322834648,6.1755905511811022,6.7440944881889759,7.0055118110236227,6.2244094488188981,4.771653543307087,3.4051181102362205,2.0905511811023625,1.4889763779527558]
["Reidsville",1.3425196850393704,1.7637795275590555,3.0877952755905511,4.4763779527559056,5.8216535433070868,6.4842519685039379,6.8346456692913389,6.1267716535433072,4.5826771653543314,3.246456692913386,1.9488188976377951,1.3181102362204726]
["Salisbury",1.4889763779527558,1.9401574803149606,3.2952755905511819,4.7007874015748037,6.0169291338582678,6.6496062992125982,6.9322834645669289,6.1755905511811022,4.7125984251968509,3.4173228346456694,2.1141732283464569,1.4523622047244096]
["Lenoir",1.4523622047244096,1.8850393700787402,3.1610236220472441,4.346456692913387,5.333464566929135,5.5748031496062991,5.6751968503937018,5.0893700787401581,4.015748031496063,3.0633858267716536,1.9606299212598426,1.3913385826771654]
["Fletcher",1.3913385826771654,1.7748031496062995,3.0633858267716536,4.4173228346456694,5.7362204724409454,6.3070866141732287,6.5417322834645679,5.9314960629921272,4.5118110236220472,3.270866141732284,1.9724409448818898,1.3547244094488189]

{"sheet":"input.form.data","index":8,"n_rows":492,"n_cols":33,"rows_kept":492,"cut":false,"hidden":false,"merged":[]}
[null,"Use Type",null,"Crops",null,"Planting Dates",null,null,"Predominant Soil","HSG",null,null,null,null,"A","B","C","D",null,"Cover Type - Area 1",null,null,null,null,null,null,"Animal Type",null,null,"Animal Type"]
[null,"Irrigation Only",null,"Bermudagrass",null,"2012-02-15",null,null,"Acredale ","C",null,null,null,"Pasture - grazed - good",39,61,74,80,null,"Pasture - grazed - good",null,null,null,null,null,null,"Beef Cattle",20,null,"Beef Cattle",15,null," "]
[null,"Irrigation and Livestock",null,"Corn (field)",null,"2012-03-01",null,null,"Acredale Poorly Drained","D ",null,null,null,"Pasture - grazed - fair",49,69,79,84,null,"Pasture - grazed - fair",null,null,null,null,null,null,"Beef Cow/calf pair",28,null,"Beef Cow",20]
[null,"Livestock Only",null,"Corn (sweet)",null,"2012-03-15",null,null,"Ailey ","B ",null,null,null,"Pasture - grazed - poor",68,79,86,89,null,"Pasture - grazed - poor",null,null,null,null,null,null,"Calves",7,null,"Beef Cow/calf pair",30,null,{"$f":"62.4/7.48","v":8.3422459893048124}]
[null,null,null,"Cotton",null,"2012-04-01",null,null,"Alaga ","A ",null,null,null,"Meadow - not grazed",30,58,71,78,null,"Meadow - not grazed",null,null,null,null,null,null,"Dry Cow",20,null,"Dry Cow",15,null,{"$f":"182/AG4","v":21.816666666666666}]
[null,null,null,"Hops",null,"2012-04-15",null,null,"Alamance ","B ",null,null,null,"Woods/grass - good",32,58,72,79,null,"Woods/grass - good",null,null,null,null,null,null,"Goats",7,null,"Goats",2]
[null,null,null,"Orchard no cover",null,"2012-05-01",null,null,"Alarka","D",null,null,null,"Woods/grass - fair",43,65,76,82,null,"Woods/grass - fair",null,null,null,null,null,null,"Horses",25,null,"Horses",8]
[null,null,null,"Orchard with cover",null,"2012-05-15",null,null,"Alpin ","A ",null,null,null,"Woods/grass - poor",57,73,82,86,null,"Woods/grass - poor",null,null,null,null,null,null,"Milking Cow",23,null,"Milking Cow",35]
[null,null,null,"Pasture Grasses",null,"2012-06-01",null,null,"Altavista ","C ",null,null,null,"Woods - good",30,55,70,77,null,"Woods - good",null,null,null,null,null,null,"Milking Cow/calf pair",35,null,"Milking Cow/calf pair",45]
[null,null,null,"Peanut",null,"2012-06-15",null,null,"Anakeesta","B",null,null,null,"Woods - fair",36,60,73,79,null,"Woods - fair",null,null,null,null,null,null,"Sheep",7,null,"Sheep and lambs",2]
[null,null,null,"Small Grain (Spring)",null,"2012-07-01",null,null,"Appling ","B ",null,null,null,"Woods - poor",45,66,77,83,null,"Woods - poor",null,null,null,null,null,null,null,null,null,"Null",0]
[null,null,null,"Small Grain (Winter)",null,"2012-07-15",null,null,"Arapahoe ","B ",null,null,null,"Fallow - Bare soil",77,86,91,94,null,"Fallow - Bare soil",null,null,null,null,null,null,"USGS water needs calculator",null,null,"Adapted from MWPS"]
[null,null,null,"Sorghum",null,"2012-08-01",null,null,"Arapahoe Poorly Drained","D ",null,null,null,"Fallow - CR - good",74,82,86,90,null,"Fallow - CR - good"]
[null,null,null,"Soybean",null,"2012-08-15",null,null,"Argent ","D ",null,null,null,"Fallow - CR - poor",76,85,90,93,null,"Fallow - CR - poor"]
[null,null,null,"Strawberries",null,"2012-09-01",null,null,"Arkaqua","C",null,null,null,"Row Crops - SR - good",67,78,85,89,null,"Row Crops - SR - good"]
[null,null,null,"Sweet Potato",null,"2012-09-15",null,null,"Armenia ","D ",null,null,null,"Row Crops - SR - poor",72,81,8,91,null,"Row Crops - SR - poor"]
[null,null,null,"Tobacco",null,"2012-10-01",null,null,"Ashe","B",null,null,null,"Row Crops - SR + CR -good",64,75,82,85,null,"Row Crops - SR + CR -good"]
[null,null,null,"Tomatoes",null,"2012-10-15",null,null,"Ashlar ","B ",null,null,null,"Row Crops - SR + CR -poor",71,80,87,90,null,"Row Crops - SR + CR -poor"]
[null,null,null,"Vegetables (small)",null,"2012-11-01",null,null,"Augusta ","C ",null,null,null,"Row Crops - C + CR - good",64,74,81,85,null,"Row Crops - C + CR - good"]
[null,null,null,"Watermelon",null,null,null,null,"Autryville ","A ",null,null,null,"Row Crops - C + CR  - poor",69,75,82,86,null,"Row Crops - C + CR  - poor"]
[null,null,null,null,null,null,null,null,"Aycock ","B ",null,null,null,"Small Grain - SR - good",63,75,83,87,null,"Small Grain - SR - good"]
[null,"Irrigation System Type",null,"efficiency",null,null,null,null,"Ayersville ","B ",null,null,null,"Small Grain - SR - poor",65,76,84,88,null,"Small Grain - SR - poor",null,null,null,null,null,null,null,null,null," "," "]
[null,"Drip",null,90,null,null,null,null,"Backbay ","D ",null,null,null,"Small Grain - SR + CR -good",60,72,80,84,null,"Small Grain - SR + CR -good"]
[null,"Center Pivot",null,80,null,null,null,null,"Badin ","B ",null,null,null,"Small Grain - SR + CR -poor",64,75,83,86,null,"Small Grain - SR + CR -poor"]
[null,"Solid Set",null,70,null,null,null,null,"Ballahack ","B"]
[null,"Traveling Gun",null,75,null,null,null,null,"Ballahack  Poorly Drained","D ",null,null,null,"Cover Type - Area 2"]
[null,"Custom",null,null,null,null,null,null,"Balsam","A",null,null,null,"Pasture - grazed - good"]
[null,null,null,null,null,null,null,null,"Bandana","B",null,null,null,"Pasture - grazed - fair"]
[null,null,null,null,null,null,null,null,"Banister ","C ",null,null,null,"Pasture - grazed - poor"]
[null,"inflow first",null,null,null,null,null,null,"Bannertown ","B ",null,null,null,"Meadow - not grazed"]
[null,"irrigation first",null,null,null,null,null,null,"Barclay ","C ",null,null,null,"Woods/grass - good"]
[null,null,null,null,null,null,null,null,"Bayboro ","D ",null,null,null,"Woods/grass - fair"]
[null,null,null,null,null,null,null,null,"Baymeade ","A ",null,null,null,"Woods/grass - poor"]
[null,null,null,null,null,null,null,null,"Beaches ","D ",null,null,null,"Woods - good"]
[null,null,null,null,null,null,null,null,"Belhaven ","D ",null,null,null,"Woods - fair"]
[null,null,null,null,null,null,null,null,"Bertie ","C ",null,null,null,"Woods - poor"]
[null,null,null,null,null,null,null,null,"Bethera ","D ",null,null,null,"Fallow - Bare soil"]
[null,null,null,null,null,null,null,null,"Bethlehem ","B ",null,null,null,"Fallow - CR - good"]
[null,null,null,null,null,null,null,null,"Bibb ","D ",null,null,null,"Fallow - CR - poor"]
[null,null,null,null,null,null,null,null,"Biltmore","A",null,null,null,"Row Crops - SR - good"]
[null,null,null,null,null,null,null,null,"Bladen ","D ",null,null,null,"Row Crops - SR - poor"]
[null,null,null,null,null,null,null,null,"Blaney ","B ",null,null,null,"Row Crops - SR + CR -good"]
[null,null,null,null,null,null,null,null,"Blanton ","A ",null,null,null,"Row Crops - SR + CR -poor"]
[null,null,null,null,null,null,null,null,"Bohicket ","D ",null,null,null,"Row Crops - C + CR - good"]
[null,null,null,null,null,null,null,null,"Bojac ","A ",null,null,null,"Row Crops - C + CR  - poor"]
[null,null,null,null,null,null,null,null,"Bolling ","C ",null,null,null,"Small Grain - SR - good"]
[null,null,null,null,null,null,null,null,"Bonneau ","A ",null,null,null,"Small Grain - SR - poor"]
[null,null,null,null,null,null,null,null,"Braddock","B",null,null,null,"Small Grain - SR + CR -good"]
[null,null,null,null,null,null,null,null,"Bradson","B",null,null,null,"Small Grain - SR + CR -poor"]
[null,null,null,null,null,null,null,null,"Bragg ","C "]
[null,null,null,null,null,null,null,null,"Brasstown","B",null,null,null,"Cover Type - Area 3"]
[null,null,null,null,null,null,null,null,"Breakneck","B",null,null,null,"Pasture - grazed - good"]
[null,null,null,null,null,null,null,null,"Brevard","B",null,null,null,"Pasture - grazed - fair"]
[null,null,null,null,null,null,null,null,"Brickhaven ","C ",null,null,null,"Pasture - grazed - poor"]
[null,null,null,null,null,null,null,null,"Brookman ","D ",null,null,null,"Meadow - not grazed"]
[null,null,null,null,null,null,null,null,"Brownwood","B",null,null,null,"Woods/grass - good"]
[null,null,null,null,null,null,null,null,"Buladean","B",null,null,null,"Woods/grass - fair"]
[null,null,null,null,null,null,null,null,"Buncombe ","A ",null,null,null,"Woods/grass - poor"]
[null,null,null,null,null,null,null,null,"Burton","B",null,null,null,"Woods - good"]
[null,null,null,null,null,null,null,null,"Butters ","B ",null,null,null,"Woods - fair"]
[null,null,null,null,null,null,null,null,"Byars ","D ",null,null,null,"Woods - poor"]
[null,null,null,null,null,null,null,null,"Cainhoy ","A ",null,null,null,"Fallow - Bare soil"]
[null,null,null,null,null,null,null,null,"Callison ","C ",null,null,null,"Fallow - CR - good"]
[null,null,null,null,null,null,null,null,"Calvin","C",null,null,null,"Fallow - CR - poor"]
[null,null,null,null,null,null,null,null,"Candor ","A ",null,null,null,"Row Crops - SR - good"]
[null,null,null,null,null,null,null,null,"Cape Fear ","C",null,null,null,"Row Crops - SR - poor"]
[null,null,null,null,null,null,null,null,"Cape Fear Poorly Drained","D ",null,null,null,"Row Crops - SR + CR -good"]
[null,null,null,null,null,null,null,null,"Cape Lookout ","C",null,null,null,"Row Crops - SR + CR -poor"]
[null,null,null,null,null,null,null,null,"Cape Lookout Poorly Drained","D ",null,null,null,"Row Crops - C + CR - good"]
[null,null,null,null,null,null,null,null,"Carbonton ","C ",null,null,null,"Row Crops - C + CR  - poor"]
[null,null,null,null,null,null,null,null,"Caroline ","C ",null,null,null,"Small Grain - SR - good"]
[null,null,null,null,null,null,null,null,"Carteret ","D ",null,null,null,"Small Grain - SR - poor"]
[null,null,null,null,null,null,null,null,"Cashiers","B",null,null,null,"Small Grain - SR + CR -good"]
[null,null,null,null,null,null,null,null,"Cataloochee","B",null,null,null,"Small Grain - SR + CR -poor"]
[null,null,null,null,null,null,null,null,"Cataska","D"]
[null,null,null,null,null,null,null,null,"Cecil ","B "]
[null,null,null,null,null,null,null,null,"Centenary ","A "]
[null,null,null,null,null,null,null,null,"Chandler","A"]
[null,null,null,null,null,null,null,null,"Chapanoke ","C"]
[null,null,null,null,null,null,null,null,"Chapanoke Poorly Drained","D "]
[null,null,null,null,null,null,null,null,"Charleston ","B "]
[null,null,null,null,null,null,null,null,"Chastain ","D "]
[null,null,null,null,null,null,null,null,"Chenneby ","C "]
[null,null,null,null,null,null,null,null,"Cheoah","B"]
[null,null,null,null,null,null,null,null,"Chesapeake ","B "]
[null,null,null,null,null,null,null,null,"Chester","B"]
[null,null,null,null,null,null,null,null,"Chestnut","B"]
[null,null,null,null,null,null,null,null,"Chestoa","B"]
[null,null,null,null,null,null,null,null,"Chewacla ","C "]
[null,null,null,null,null,null,null,null,"Chiltoskie","B"]
[null,null,null,null,null,null,null,null,"Chipley ","B "]
[null,null,null,null,null,null,null,null,"Chowan ","D "]
[null,null,null,null,null,null,null,null,"Chute","D"]
[null,null,null,null,null,null,null,null,"Cid ","C "]
[null,null,null,null,null,null,null,null,"Claycreek ","C "]
[null,null,null,null,null,null,null,null,"Cleveland","C"]
[null,null,null,null,null,null,null,null,"Cliffield","B"]
[null,null,null,null,null,null,null,null,"Clifford ","B "]
[null,null,null,null,null,null,null,null,"Cliffside ","B "]
[null,null,null,null,null,null,null,null,"Clifton","B"]
[null,null,null,null,null,null,null,null,"Clingman","D"]
[null,null,null,null,null,null,null,null,"Codorus ","C "]
[null,null,null,null,null,null,null,null,"Colfax ","C "]
[null,null,null,null,null,null,null,null,"Colvard","A"]
[null,null,null,null,null,null,null,null,"Conaby ","B"]
[null,null,null,null,null,null,null,null,"Conaby Poorly Drained","D "]
[null,null,null,null,null,null,null,null,"Conetoe ","A "]
[null,null,null,null,null,null,null,null,"Congaree ","C "]
[null,null,null,null,null,null,null,null,"Corolla ","A"]
[null,null,null,null,null,null,null,null,"Corolla Poorly Drained","D "]
[null,null,null,null,null,null,null,null,"Coronaca ","B "]
[null,null,null,null,null,null,null,null,"Cowarts ","C "]
[null,null,null,null,null,null,null,null,"Cowee","B"]
[null,null,null,null,null,null,null,null,"Coxville ","D "]
[null,null,null,null,null,null,null,null,"Craggey","D"]
[null,null,null,null,null,null,null,null,"Craven ","C "]
[null,null,null,null,null,null,null,null,"Creedmoor ","C "]
[null,null,null,null,null,null,null,null,"Croatan ","C"]
[null,null,null,null,null,null,null,null,"Croatan Poorly Drained","D "]
[null,null,null,null,null,null,null,null,"Crossnore","B"]
[null,null,null,null,null,null,null,null,"Cruso","A"]
[null,null,null,null,null,null,null,null,"Cullasaja","A"]
[null,null,null,null,null,null,null,null,"Cullen ","C "]
[null,null,null,null,null,null,null,null,"Cullowhee","B"]
[null,null,null,null,null,null,null,null,"Cullowhee","D"]
[null,null,null,null,null,null,null,null,"Currituck ","D "]
[null,null,null,null,null,null,null,null,"Dare ","D "]
[null,null,null,null,null,null,null,null,"Davidson ","B "]
[null,null,null,null,null,null,null,null,"Dellwood","A"]
[null,null,null,null,null,null,null,null,"Deloss ","B "]
[null,null,null,null,null,null,null,null,"Deloss Poorly Drained","D "]
[null,null,null,null,null,null,null,null,"Delway ","D "]
[null,null,null,null,null,null,null,null,"Devotion ","C "]
[null,null,null,null,null,null,null,null,"Dillard","C"]
[null,null,null,null,null,null,null,null,"Dillsboro","B"]
[null,null,null,null,null,null,null,null,"Ditney","C"]
[null,null,null,null,null,null,null,null,"Dogue ","C "]
[null,null,null,null,null,null,null,null,"Dorovan ","D "]
[null,null,null,null,null,null,null,null,"Dothan ","B "]
[null,null,null,null,null,null,null,null,"Dragston ","C "]
[null,null,null,null,null,null,null,null,"Duckston ","A"]
[null,null,null,null,null,null,null,null,"Duckston Poorly Drained","D "]
[null,null,null,null,null,null,null,null,"Dunbar ","C"]
[null,null,null,null,null,null,null,null,"Dunbar Poorly Drained","D "]
[null,null,null,null,null,null,null,null,"Dune land ","A "]
[null,null,null,null,null,null,null,null,"Duplin ","C "]
[null,null,null,null,null,null,null,null,"Durham ","B "]
[null,null,null,null,null,null,null,null,"Echaw ","A "]
[null,null,null,null,null,null,null,null,"Edneytown","B"]
[null,null,null,null,null,null,null,null,"Edneyville","A"]
[null,null,null,null,null,null,null,null,"Ela","B"]
[null,null,null,null,null,null,null,null,"Ela","D"]
[null,null,null,null,null,null,null,null,"Ellijay","B"]
[null,null,null,null,null,null,null,null,"Elsinboro","B"]
[null,null,null,null,null,null,null,null,"Emporia ","C "]
[null,null,null,null,null,null,null,null,"Engelhard ","B"]
[null,null,null,null,null,null,null,null,"Engelhard Poorly Drained","D "]
[null,null,null,null,null,null,null,null,"Enon ","C "]
[null,null,null,null,null,null,null,null,"Eutrochrepts","B"]
[null,null,null,null,null,null,null,null,"Evard","B"]
[null,null,null,null,null,null,null,null,"Exum ","C "]
[null,null,null,null,null,null,null,null,"Exway ","B "]
[null,null,null,null,null,null,null,null,"Faceville ","B "]
[null,null,null,null,null,null,null,null,"Fairview ","B "]
[null,null,null,null,null,null,null,null,"Fannin","B"]
[null,null,null,null,null,null,null,null,"Fletcher","B"]
[null,null,null,null,null,null,null,null,"Fluvaquents","D"]
[null,null,null,null,null,null,null,null,"Fontaflora","A"]
[null,null,null,null,null,null,null,null,"Foreston ","B "]
[null,null,null,null,null,null,null,null,"Fork ","C "]
[null,null,null,null,null,null,null,null,"Fortescue ","C"]
[null,null,null,null,null,null,null,null,"Fortescue Poorly Drained","D "]
[null,null,null,null,null,null,null,null,"French","C"]
[null,null,null,null,null,null,null,null,"Fripp ","A "]
[null,null,null,null,null,null,null,null,"Fuquay ","B "]
[null,null,null,null,null,null,null,null,"Gaston ","B "]
[null,null,null,null,null,null,null,null,"Georgeville ","B "]
[null,null,null,null,null,null,null,null,"Gertie ","D "]
[null,null,null,null,null,null,null,null,"Gilead ","C "]
[null,null,null,null,null,null,null,null,"Goldsboro ","B "]
[null,null,null,null,null,null,null,null,"Goldston ","C "]
[null,null,null,null,null,null,null,null,"Grantham ","D "]
[null,null,null,null,null,null,null,null,"Granville ","B "]
[null,null,null,null,null,null,null,null,"Green Level ","D "]
[null,null,null,null,null,null,null,null,"Greenlee","A"]
[null,null,null,null,null,null,null,null,"Grifton ","D "]
[null,null,null,null,null,null,null,null,"Gritney ","C "]
[null,null,null,null,null,null,null,null,"Grover ","B "]
[null,null,null,null,null,null,null,null,"Gullied land ","D "]
[null,null,null,null,null,null,null,null,"Gullrock ","C"]
[null,null,null,null,null,null,null,null,"Gullrock Poorly Drained","D "]
[null,null,null,null,null,null,null,null,"Guyot","B"]
[null,null,null,null,null,null,null,null,"Gwinnett ","B "]
[null,null,null,null,null,null,null,null,"Hallison ","C "]
[null,null,null,null,null,null,null,null,"Harmiller","B"]
[null,null,null,null,null,null,null,null,"Hatboro ","B"]
[null,null,null,null,null,null,null,null,"Hatboro Poorly Drained","D "]
[null,null,null,null,null,null,null,null,"Hayesville","B"]
[null,null,null,null,null,null,null,null,"Heintooga","A"]
[null,null,null,null,null,null,null,null,"Helena ","C "]
[null,null,null,null,null,null,null,null,"Hemphill","D"]
[null,null,null,null,null,null,null,null,"Herndon ","B "]
[null,null,null,null,null,null,null,null,"Hibriten ","B "]
[null,null,null,null,null,null,null,null,"Hiwassee ","B "]
[null,null,null,null,null,null,null,null,"Hobonny ","D "]
[null,null,null,null,null,null,null,null,"Hobucken ","D "]
[null,null,null,null,null,null,null,null,"Hornsboro ","D "]
[null,null,null,null,null,null,null,null,"Hulett ","B "]
[null,null,null,null,null,null,null,null,"Huntdale","B"]
[null,null,null,null,null,null,null,null,"Hyde ","D "]
[null,null,null,null,null,null,null,null,"Hyde Poorly Drained","C"]
[null,null,null,null,null,null,null,null,"Hydeland ","C "]
[null,null,null,null,null,null,null,null,"Hydeland Poorly Drained","D "]
[null,null,null,null,null,null,null,null,"Icaria ","B"]
[null,null,null,null,null,null,null,null,"Icaria Poorly Drained","D "]
[null,null,null,null,null,null,null,null,"Invershiel ","C "]
[null,null,null,null,null,null,null,null,"Iotla","B"]
[null,null,null,null,null,null,null,null,"Iredell ","C "]
[null,null,null,null,null,null,null,null,"Iredell Poorly Drained","D "]
[null,null,null,null,null,null,null,null,"Jeffrey","B"]
[null,null,null,null,null,null,null,null,"Johns ","C "]
[null,null,null,null,null,null,null,null,"Johnston ","D "]
[null,null,null,null,null,null,null,null,"Junaluska","B"]
[null,null,null,null,null,null,null,null,"Kalmia ","B "]
[null,null,null,null,null,null,null,null,"Kanuga","B"]
[null,null,null,null,null,null,null,null,"Keener","B"]
[null,null,null,null,null,null,null,null,"Kenansville ","A "]
[null,null,null,null,null,null,null,null,"Kinkora","D"]
[null,null,null,null,null,null,null,null,"Kinston ","B"]
[null,null,null,null,null,null,null,null,"Kinston Poorly Drained","D "]
[null,null,null,null,null,null,null,null,"Kirksey ","C "]
[null,null,null,null,null,null,null,null,"Kureb ","A "]
[null,null,null,null,null,null,null,null,"Lakeland ","A "]
[null,null,null,null,null,null,null,null,"Lauada","B"]
[null,null,null,null,null,null,null,null,"Leaf ","D "]
[null,null,null,null,null,null,null,null,"Leaksville ","D "]
[null,null,null,null,null,null,null,null,"Leatherwood","B"]
[null,null,null,null,null,null,null,null,"Lenoir ","D "]
[null,null,null,null,null,null,null,null,"Leon ","B"]
[null,null,null,null,null,null,null,null,"Leon Poorly Drained","D "]
[null,null,null,null,null,null,null,null,"Liddell ","B"]
[null,null,null,null,null,null,null,null,"Liddell Poorly Drained","D "]
[null,null,null,null,null,null,null,null,"Lignum ","C "]
[null,null,null,null,null,null,null,null,"Lillington ","B "]
[null,null,null,null,null,null,null,null,"Lloyd ","B "]
[null,null,null,null,null,null,null,null,"Longhope","D"]
[null,null,null,null,null,null,null,null,"Longshoal ","D "]
[null,null,null,null,null,null,null,null,"Lonon","B"]
[null,null,null,null,null,null,null,null,"Lostcove","B"]
[null,null,null,null,null,null,null,null,"Louisa ","B "]
[null,null,null,null,null,null,null,null,"Louisburg ","B "]
[null,null,null,null,null,null,null,null,"Lucy ","A "]
[null,null,null,null,null,null,null,null,"Luftee","B"]
[null,null,null,null,null,null,null,null,"Lumbee ","B"]
[null,null,null,null,null,null,null,null,"Lumbee Poorly Drained","D "]
[null,null,null,null,null,null,null,null,"Lynchburg ","C "]
[null,null,null,null,null,null,null,null,"Lynn Haven ","B"]
[null,null,null,null,null,null,null,null,"Lynn Haven Poorly Drained","D "]
[null,null,null,null,null,null,null,null,"Madison ","B "]
[null,null,null,null,null,null,null,null,"Mandarin ","B "]
[null,null,null,null,null,null,null,null,"Mantachie ","B"]
[null,null,null,null,null,null,null,null,"Mantachie Poorly Drained","D "]
[null,null,null,null,null,null,null,null,"Marlboro ","B "]
[null,null,null,null,null,null,null,null,"Mars Hill","B"]
[null,null,null,null,null,null,null,null,"Marvyn ","B "]
[null,null,null,null,null,null,null,null,"Masada ","C "]
[null,null,null,null,null,null,null,null,"Masontown ","D "]
[null,null,null,null,null,null,null,null,"Mattaponi ","C "]
[null,null,null,null,null,null,null,null,"Maxton ","B "]
[null,null,null,null,null,null,null,null,"Maymead","A"]
[null,null,null,null,null,null,null,null,"Mayodan ","B "]
[null,null,null,null,null,null,null,null,"McColl ","D "]
[null,null,null,null,null,null,null,null,"McQueen ","C "]
[null,null,null,null,null,null,null,null,"Meadowfield ","B "]
[null,null,null,null,null,null,null,null,"Mecklenburg ","C "]
[null,null,null,null,null,null,null,null,"Meggett ","D "]
[null,null,null,null,null,null,null,null,"Merry Oaks ","D "]
[null,null,null,null,null,null,null,null,"Micaville","B"]
[null,null,null,null,null,null,null,null,"Misenheimer ","C "]
[null,null,null,null,null,null,null,null,"Mocksville ","B "]
[null,null,null,null,null,null,null,null,"Monacan ","C "]
[null,null,null,null,null,null,null,null,"Moncure ","D "]
[null,null,null,null,null,null,null,null,"Montonia ","B "]
[null,null,null,null,null,null,null,null,"Mooshaunee ","C "]
[null,null,null,null,null,null,null,null,"Muckalee ","D "]
[null,null,null,null,null,null,null,null,"Munden ","B "]
[null,null,null,null,null,null,null,null,"Murville ","A "]
[null,null,null,null,null,null,null,null,"Murville Poorly Drained","D "]
[null,null,null,null,null,null,null,null,"Myatt ","B"]
[null,null,null,null,null,null,null,null,"Myatt Poorly Drained","D "]
[null,null,null,null,null,null,null,null,"Nahunta ","C "]
[null,null,null,null,null,null,null,null,"Nakina ","B"]
[null,null,null,null,null,null,null,null,"Nakina Poorly Drained","D "]
[null,null,null,null,null,null,null,null,"Nanford ","B "]
[null,null,null,null,null,null,null,null,"Nankin ","C "]
[null,null,null,null,null,null,null,null,"Nantahala","B"]
[null,null,null,null,null,null,null,null,"Nason ","B "]
[null,null,null,null,null,null,null,null,"Nawney ","D "]
[null,null,null,null,null,null,null,null,"Neeses ","C "]
[null,null,null,null,null,null,null,null,"Newhan ","A "]
[null,null,null,null,null,null,null,null,"Newholland ","B"]
[null,null,null,null,null,null,null,null,"Newholland Poorl Drained","D "]
[null,null,null,null,null,null,null,null,"Nikwasi","B/D"]
[null,null,null,null,null,null,null,null,"Nimmo ","B"]
[null,null,null,null,null,null,null,null,"Nimmo Poorly Drained","D "]
[null,null,null,null,null,null,null,null,"Nixonton ","C "]
[null,null,null,null,null,null,null,null,"Noboco ","B "]
[null,null,null,null,null,null,null,null,"Norfolk ","B "]
[null,null,null,null,null,null,null,null,"Northcove","A"]
[null,null,null,null,null,null,null,null,"Nowhere","B"]
[null,null,null,null,null,null,null,null,"Oakboro ","C "]
[null,null,null,null,null,null,null,null,"Ocilla ","C "]
[null,null,null,null,null,null,null,null,"Oconaluftee","A"]
[null,null,null,null,null,null,null,null,"Onslow ","B "]
[null,null,null,null,null,null,null,null,"Orange ","D "]
[null,null,null,null,null,null,null,null,"Orangeburg ","B "]
[null,null,null,null,null,null,null,null,"Osier ","A "]
[null,null,null,null,null,null,null,null,"Osier Poorly Drained","D "]
[null,null,null,null,null,null,null,null,"Ostin","A"]
[null,null,null,null,null,null,null,null,"Oteen","C"]
[null,null,null,null,null,null,null,null,"Ousley ","B "]
[null,null,null,null,null,null,null,null,"Pacolet ","B "]
[null,null,null,null,null,null,null,null,"Pactolus ","B "]
[null,null,null,null,null,null,null,null,"Pamlico ","D "]
[null,null,null,null,null,null,null,null,"Pantego ","B"]
[null,null,null,null,null,null,null,null,"Pantego Poorly Drained","D "]
[null,null,null,null,null,null,null,null,"Pasquotank ","B"]
[null,null,null,null,null,null,null,null,"Pasquotank Poorly Drained","D "]
[null,null,null,null,null,null,null,null,"Paxville ","B"]
[null,null,null,null,null,null,null,null,"Paxville Poorly Drained","D "]
[null,null,null,null,null,null,null,null,"Peakin ","B "]
[null,null,null,null,null,null,null,null,"Peawick ","D "]
[null,null,null,null,null,null,null,null,"Pelion ","B"]
[null,null,null,null,null,null,null,null,"Pelion Poorly Drained","D "]
[null,null,null,null,null,null,null,null,"Pender ","C "]
[null,null,null,null,null,null,null,null,"Perquimans ","C "]
[null,null,null,null,null,null,null,null,"Perquimans Poorly Drained","D "]
[null,null,null,null,null,null,null,null,"Pettigrew ","D "]
[null,null,null,null,null,null,null,null,"Picture ","D "]
[null,null,null,null,null,null,null,null,"Pigeonroost","B"]
[null,null,null,null,null,null,null,null,"Pilot Mountain","B"]
[null,null,null,null,null,null,null,null,"Pinkston ","B "]
[null,null,null,null,null,null,null,null,"Pinoka ","B "]
[null,null,null,null,null,null,null,null,"Pittsboro ","D "]
[null,null,null,null,null,null,null,null,"Plott","A"]
[null,null,null,null,null,null,null,null,"Plummer ","A "]
[null,null,null,null,null,null,null,null,"Plummer Poorly Drained","D "]
[null,null,null,null,null,null,null,null,"Pocalla ","A "]
[null,null,null,null,null,null,null,null,"Poindexter ","B "]
[null,null,null,null,null,null,null,null,"Polawana ","A "]
[null,null,null,null,null,null,null,null,"Polawana Poorly Drained","D "]
[null,null,null,null,null,null,null,null,"Polkton ","D "]
[null,null,null,null,null,null,null,null,"Ponzer ","D "]
[null,null,null,null,null,null,null,null,"Porters","B"]
[null,null,null,null,null,null,null,null,"Portsmouth ","B"]
[null,null,null,null,null,null,null,null,"Portsmouth Poorly Drained","D "]
[null,null,null,null,null,null,null,null,"Pullback","D"]
[null,null,null,null,null,null,null,null,"Pungo ","D "]
[null,null,null,null,null,null,null,null,"Rains ","B"]
[null,null,null,null,null,null,null,null,"Rains Poorly Drained","D "]
[null,null,null,null,null,null,null,null,"Redbrush ","C "]
[null,null,null,null,null,null,null,null,"Reddies","B"]
[null,null,null,null,null,null,null,null,"Rhodhiss ","B "]
[null,null,null,null,null,null,null,null,"Rimini ","A "]
[null,null,null,null,null,null,null,null,"Rion ","B "]
[null,null,null,null,null,null,null,null,"Riverview ","B "]
[null,null,null,null,null,null,null,null,"Roanoke ","C "]
[null,null,null,null,null,null,null,null,"Roanoke Poorly Drained","D "]
[null,null,null,null,null,null,null,null,"Rock outcrop","D"]
[null,null,null,null,null,null,null,null,"Roper ","C "]
[null,null,null,null,null,null,null,null,"Roper Poorly Drained","D "]
[null,null,null,null,null,null,null,null,"Rosman","A"]
[null,null,null,null,null,null,null,null,"Rubble land","A"]
[null,null,null,null,null,null,null,null,"Rumford ","B "]
[null,null,null,null,null,null,null,null,"Ruston ","B "]
[null,null,null,null,null,null,null,null,"Rutlege ","B"]
[null,null,null,null,null,null,null,null,"Rutlege Poorly Drained","D "]
[null,null,null,null,null,null,null,null,"Saluda","C"]
[null,null,null,null,null,null,null,null,"Santeetlah","A"]
[null,null,null,null,null,null,null,null,"Saunook","B"]
[null,null,null,null,null,null,null,null,"Sauratown","B"]
[null,null,null,null,null,null,null,null,"Saw ","B "]
[null,null,null,null,null,null,null,null,"Scuppernong ","D "]
[null,null,null,null,null,null,null,null,"Seabrook ","B "]
[null,null,null,null,null,null,null,null,"Seagate ","B "]
[null,null,null,null,null,null,null,null,"Secrest ","C "]
[null,null,null,null,null,null,null,null,"Sedgefield ","C "]
[null,null,null,null,null,null,null,null,"Seewee ","B "]
[null,null,null,null,null,null,null,null,"Shellbluff ","B "]
[null,null,null,null,null,null,null,null,"Shinbone","B"]
[null,null,null,null,null,null,null,null,"Siloam ","D "]
[null,null,null,null,null,null,null,null,"Skyuka ","B "]
[null,null,null,null,null,null,null,null,"Smokemont","A"]
[null,null,null,null,null,null,null,null,"Snowbird","B"]
[null,null,null,null,null,null,null,null,"Soco","B"]
[null,null,null,null,null,null,null,null,"Spivey","A"]
[null,null,null,null,null,null,null,null,"Spray ","B "]
[null,null,null,null,null,null,null,null,"Stallings ","C "]
[null,null,null,null,null,null,null,null,"Starr ","B "]
[null,null,null,null,null,null,null,null,"State ","B "]
[null,null,null,null,null,null,null,null,"Statler","B"]
[null,null,null,null,null,null,null,null,"Stecoah","B"]
[null,null,null,null,null,null,null,null,"Stockade ","B"]
[null,null,null,null,null,null,null,null,"Stockade Poorly Drained","D "]
[null,null,null,null,null,null,null,null,"Stoneville ","B "]
[null,null,null,null,null,null,null,null,"Stott Knob ","B "]
[null,null,null,null,null,null,null,null,"Suches","B"]
[null,null,null,null,null,null,null,null,"Suffolk ","B "]
[null,null,null,null,null,null,null,null,"Swannanoa","C"]
[null,null,null,null,null,null,null,null,"Sylco","C"]
[null,null,null,null,null,null,null,null,"Sylva","A"]
[null,null,null,null,null,null,null,null,"Sylva","D"]
[null,null,null,null,null,null,null,null,"Tallapoosa ","C "]
[null,null,null,null,null,null,null,null,"Tanasee","A"]
[null,null,null,null,null,null,null,null,"Tarboro ","A "]
[null,null,null,null,null,null,null,null,"Tarrus ","B "]
[null,null,null,null,null,null,null,null,"Tate","B"]
[null,null,null,null,null,null,null,null,"Tatum ","B "]
[null,null,null,null,null,null,null,null,"Tetotum ","C "]
[null,null,null,null,null,null,null,null,"Thunder","B"]
[null,null,null,null,null,null,null,null,"Thurmont","B"]
[null,null,null,null,null,null,null,null,"Thursa ","B "]
[null,null,null,null,null,null,null,null,"Toast ","B "]
[null,null,null,null,null,null,null,null,"Toccoa ","B "]
[null,null,null,null,null,null,null,null,"Toecane","A"]
[null,null,null,null,null,null,null,null,"Toisnot ","D "]
[null,null,null,null,null,null,null,null,"Tomahawk ","B "]
[null,null,null,null,null,null,null,null,"Tomotley ","B"]
[null,null,null,null,null,null,null,null,"Tomotley Poorly Drained","D "]
[null,null,null,null,null,null,null,null,"Torhunta ","C "]
[null,null,null,null,null,null,null,null,"Toxaway","B"]
[null,null,null,null,null,null,null,null,"Toxaway","D"]
[null,null,null,null,null,null,null,null,"Transylvania","B"]
[null,null,null,null,null,null,null,null,"Trimont","B"]
[null,null,null,null,null,null,null,null,"﻿Troup ","A "]
[null,null,null,null,null,null,null,null,"Tsali","C"]
[null,null,null,null,null,null,null,null,"Tuckasegee","A"]
[null,null,null,null,null,null,null,null,"Turbeville ","C "]
[null,null,null,null,null,null,null,null,"Tusquitee","B"]
[null,null,null,null,null,null,null,null,"Uchee ","A "]
[null,null,null,null,null,null,null,null,"Udifluvents","A"]
[null,null,null,null,null,null,null,null,"Udorthents","B"]
[null,null,null,null,null,null,null,null,"Unaka","B"]
[null,null,null,null,null,null,null,null,"Unicoi","C"]
[null,null,null,null,null,null,null,null,"Unison","B"]
[null,null,null,null,null,null,null,null,"Uwharrie ","B "]
[null,null,null,null,null,null,null,null,"Valhalla ","A "]
[null,null,null,null,null,null,null,null,"Vance ","C "]
[null,null,null,null,null,null,null,null,"Varina ","C "]
[null,null,null,null,null,null,null,null,"Vaucluse ","C "]
[null,null,null,null,null,null,null,null,"Wadesboro ","B "]
[null,null,null,null,null,null,null,null,"Wagram ","A "]
[null,null,null,null,null,null,null,null,"Wahee ","C "]
[null,null,null,null,null,null,null,null,"Wahee Poorly Drained","D "]
[null,null,null,null,null,null,null,null,"Wake ","D "]
[null,null,null,null,null,null,null,null,"Wakulla ","A "]
[null,null,null,null,null,null,null,null,"Walnut","B"]
[null,null,null,null,null,null,null,null,"Wando ","A "]
[null,null,null,null,null,null,null,null,"Wasda ","B "]
[null,null,null,null,null,null,null,null,"Wasda Poorly Drained","D "]
[null,null,null,null,null,null,null,null,"Watauga","B"]
[null,null,null,null,null,null,null,null,"Wateree ","B "]
[null,null,null,null,null,null,null,null,"Wayah","B"]
[null,null,null,null,null,null,null,null,"Wedowee ","B "]
[null,null,null,null,null,null,null,null,"Weeksville ","B "]
[null,null,null,null,null,null,null,null,"Weeksville ","D "]
[null,null,null,null,null,null,null,null,"Wehadkee ","D "]
[null,null,null,null,null,null,null,null,"Wesser","B"]
[null,null,null,null,null,null,null,null,"Wesser","D"]
[null,null,null,null,null,null,null,null,"Westfield ","B "]
[null,null,null,null,null,null,null,null,"White Store ","D "]
[null,null,null,null,null,null,null,null,"Whiteoak","B"]
[null,null,null,null,null,null,null,null,"Whiteside","B"]
[null,null,null,null,null,null,null,null,"Wickham ","B "]
[null,null,null,null,null,null,null,null,"Wilbanks ","D "]
[null,null,null,null,null,null,null,null,"Wilkes ","D "]
[null,null,null,null,null,null,null,null,"Winnsboro ","C "]
[null,null,null,null,null,null,null,null,"Winton ","C "]
[null,null,null,null,null,null,null,null,"Woodington ","B "]
[null,null,null,null,null,null,null,null,"Woodington Poorly Drained","D "]
[null,null,null,null,null,null,null,null,"Woolwine ","B "]
[null,null,null,null,null,null,null,null,"Worsham ","D "]
[null,null,null,null,null,null,null,null,"Wrightsboro ","C "]
[null,null,null,null,null,null,null,null,"Wynott ","C "]
[null,null,null,null,null,null,null,null,"Wysocking ","B "]
[null,null,null,null,null,null,null,null,"Wysocking Poorly Drained","D "]
[null,null,null,null,null,null,null,null,"Yaupon ","D "]
[null,null,null,null,null,null,null,null,"Yeopim ","C "]
[null,null,null,null,null,null,null,null,"Yonges ","C "]
[null,null,null,null,null,null,null,null,"Yonges Poorly Drained","D "]
[null,null,null,null,null,null,null,null,"Zillicoa","C"]
[null,null,null,null,null,null,null,null,"Zion ","C "]

{"sheet":"kcs","index":9,"n_rows":486,"n_cols":27,"rows_kept":486,"cut":false,"hidden":false,"merged":[]}
[null,null,"days.init","day.dev","days.mid","days.late","total","kc.ini","kc.mid","kc.late",null,"JD","kc.1.init","kc.1.dev","kc.1.mid","kc.1.late","kc.1","kc.2.init","kc.2.dev","kc.2.mid","kc.2.late","kc.2","kc.3.init","kc.3.dev","kc.3.mid","kc.3.late","kc.3"]
[null,"Corn (field)",20,35,40,30,{"$f":"SUM(C2:F2)","v":125},0.3,1.2,0.6,null,1,{"$f":"MAX(IF(OR(kcjd<jdplant1,kcjd>jdplant1+C$22),0,kc.ini.1),M367)","v":0},{"$f":"MAX(IF(OR(kcjd<jdplant1+C$22,kcjd>jdplant1+SUM(C$22,D$22)),0,+H$22+(kcjd-(jdplant1+C$22))/(jdplant1+SUM(C$22,D$22)-(jdplant1+C$22))*(I$22-H$22)),N367)","v":0},{"$f":"MAX(IF(OR(kcjd<jdplant1+SUM(C$22,D$22),kcjd>jdplant1+SUM(C$22,D$22,E$22)),0,kc.mid.1),O367)","v":0},{"$f":"MAX(IF(OR(kcjd<jdplant1+SUM(C$22:E$22),kcjd>jdplant1+G$22),0,+I$22-(kcjd-(jdplant1+SUM(C$22:E$22)))/((jdplant1+G$22)-(jdplant1+SUM(C$22:E$22)))*(I$22-J$22)),P367)","v":0},{"$f":"MAX(M2:P2)","v":0},{"$f":"MAX(IF(OR(kcjd<jdplant2,kcjd>jdplant2+$C$23),0,kc.ini.2),R367)","v":{"$error":"#N/A"}},{"$f":"MAX(IF(OR(kcjd<jdplant2+$C$23,kcjd>jdplant2+SUM($C$23,$D$23)),0,+kc.ini.2+(kcjd-(jdplant2+$C$23))/(jdplant2+SUM($C$23,$D$23)-(jdplant2+$C$23))*(kc.mid.2-kc.ini.2)),S367)","v":{"$error":"#N/A"}},{"$f":"MAX(IF(OR(kcjd<jdplant2+SUM($C$23,$D$23),kcjd>jdplant2+SUM($C$23,$D$23,$E$23)),0,kc.mid.2),T367)","v":{"$error":"#N/A"}},{"$f":"MAX(IF(OR(kcjd<jdplant2+SUM($C$23:$E$23),kcjd>jdplant2+$G$23),0,+kc.mid.2-(kcjd-(jdplant2+SUM($C$23:$E$23)))/((jdplant2+$G$23)-(jdplant2+SUM($C$23:$E$23)))*(kc.mid.2-kc.late.2)),U367)","v":{"$error":"#N/A"}},{"$f":"MAX(R2:U2)","v":{"$error":"#N/A"}},{"$f":"MAX(IF(OR(kcjd<jdplant3,kcjd>jdplant3+$C$24),0,kc.ini.3),W367)","v":{"$error":"#N/A"}},{"$f":"MAX(IF(OR(kcjd<jdplant3+$C$24,kcjd>jdplant3+SUM($C$24,$D$24)),0,+kc.ini.3+(kcjd-(jdplant3+$C$24))/(jdplant3+SUM($C$24,$D$24)-(jdplant3+$C$24))*(kc.mid.3-kc.ini.3)),X367)","v":{"$error":"#N/A"}},{"$f":"MAX(IF(OR(kcjd<jdplant3+SUM($C$24,$D$24),kcjd>jdplant3+SUM($C$24,$D$24,$E$24)),0,kc.mid.3),Y367)","v":{"$error":"#N/A"}},{"$f":"MAX(IF(OR(kcjd<jdplant3+SUM($C$24:$E$24),kcjd>jdplant3+$G$24),0,+kc.mid.3-(kcjd-(jdplant3+SUM($C$24:$E$24)))/((jdplant3+$G$24)-(jdplant3+SUM($C$24:$E$24)))*(kc.mid.3-kc.late.3)),Z367)","v":{"$error":"#N/A"}},{"$f":"MAX(W2:Z2)","v":{"$error":"#N/A"}}]
[null,"Corn (sweet)",20,20,30,10,{"$f":"SUM(C3:F3)","v":80},0.3,1.1499999999999999,1.05,null,2,0,0,0,0,{"$f":"MAX(M3:P3)","v":0},{"$error":"#N/A"},{"$error":"#N/A"},{"$error":"#N/A"},{"$error":"#N/A"},{"$f":"MAX(R3:U3)","v":{"$error":"#N/A"}},{"$error":"#N/A"},{"$error":"#N/A"},{"$error":"#N/A"},{"$error":"#N/A"},{"$f":"MAX(W3:Z3)","v":{"$error":"#N/A"}}]
[null,"Cotton",30,50,55,45,180,0.35,1.1499999999999999,0.6,null,3,0,0,0,0,0,{"$error":"#N/A"},{"$error":"#N/A"},{"$error":"#N/A"},{"$error":"#N/A"},{"$error":"#N/A"},{"$error":"#N/A"},{"$error":"#N/A"},{"$error":"#N/A"},{"$error":"#N/A"},{"$error":"#N/A"}]
[null,"Soybean",20,35,60,25,140,0.4,1.1499999999999999,0.5,null,4,0,0,0,0,0,{"$error":"#N/A"},{"$error":"#N/A"},{"$error":"#N/A"},{"$error":"#N/A"},{"$error":"#N/A"},{"$error":"#N/A"},{"$error":"#N/A"},{"$error":"#N/A"},{"$error":"#N/A"},{"$error":"#N/A"}]
[null,"Peanut",35,35,35,35,140,0.4,1.1499999999999999,0.6,null,5,0,0,0,0,0,{"$error":"#N/A"},{"$error":"#N/A"},{"$error":"#N/A"},{"$error":"#N/A"},{"$error":"#N/A"},{"$error":"#N/A"},{"$error":"#N/A"},{"$error":"#N/A"},{"$error":"#N/A"},{"$error":"#N/A"}]
[null,"Small Grain (Winter)",20,60,70,30,180,0.7,1.1499999999999999,0.25,null,6,0,0,0,0,0,{"$error":"#N/A"},{"$error":"#N/A"},{"$error":"#N/A"},{"$error":"#N/A"},{"$error":"#N/A"},{"$error":"#N/A"},{"$error":"#N/A"},{"$error":"#N/A"},{"$error":"#N/A"},{"$error":"#N/A"}]
[null,"Small Grain (Spring)",20,25,60,30,135,0.3,1.1499999999999999,0.25,null,7,0,0,0,0,0,{"$error":"#N/A"},{"$error":"#N/A"},{"$error":"#N/A"},{"$error":"#N/A"},{"$error":"#N/A"},{"$error":"#N/A"},{"$error":"#N/A"},{"$error":"#N/A"},{"$error":"#N/A"},{"$error":"#N/A"}]
[null,"Sorghum",20,35,40,30,125,0.3,1.1000000000000001,0.55000000000000004,null,8,0,0,0,0,0,{"$error":"#N/A"},{"$error":"#N/A"},{"$error":"#N/A"},{"$error":"#N/A"},{"$error":"#N/A"},{"$error":"#N/A"},{"$error":"#N/A"},{"$error":"#N/A"},{"$error":"#N/A"},{"$error":"#N/A"}]
[null,"Pasture Grasses",10,20,75,60,165,0.4,0.85,0.85,null,9,0,0,0,0,0,{"$error":"#N/A"},{"$error":"#N/A"},{"$error":"#N/A"},{"$error":"#N/A"},{"$error":"#N/A"},{"$error":"#N/A"},{"$error":"#N/A"},{"$error":"#N/A"},{"$error":"#N/A"},{"$error":"#N/A"}]
[null,"Tomatoes",30,40,45,25,140,0.6,1.1499999999999999,0.8,null,10,0,0,0,0,0,{"$error":"#N/A"},{"$error":"#N/A"},{"$error":"#N/A"},{"$error":"#N/A"},{"$error":"#N/A"},{"$error":"#N/A"},{"$error":"#N/A"},{"$error":"#N/A"},{"$error":"#N/A"},{"$error":"#N/A"}]
[null,"Orchard with Cover",20,70,90,30,210,0.5,1.1499999999999999,0.9,null,11,0,0,0,0,0,{"$error":"#N/A"},{"$error":"#N/A"},{"$error":"#N/A"},{"$error":"#N/A"},{"$error":"#N/A"},{"$error":"#N/A"},{"$error":"#N/A"},{"$error":"#N/A"},{"$error":"#N/A"},{"$error":"#N/A"}]
[null,"Orchard no Cover",20,70,90,30,{"$f":"SUM(C13:F13)","v":210},0.45,0.9,0.65,null,12,0,0,0,0,0,{"$error":"#N/A"},{"$error":"#N/A"},{"$error":"#N/A"},{"$error":"#N/A"},{"$error":"#N/A"},{"$error":"#N/A"},{"$error":"#N/A"},{"$error":"#N/A"},{"$error":"#N/A"},{"$error":"#N/A"}]
[null,"Hops",25,40,80,10,155,0.3,1.05,0.85,null,13,0,0,0,0,0,{"$error":"#N/A"},{"$error":"#N/A"},{"$error":"#N/A"},{"$error":"#N/A"},{"$error":"#N/A"},{"$error":"#N/A"},{"$error":"#N/A"},{"$error":"#N/A"},{"$error":"#N/A"},{"$error":"#N/A"}]
[null,"Bermudagrass",10,15,90,40,155,0.55000000000000004,1,0.85,null,14,0,0,0,0,0,{"$error":"#N/A"},{"$error":"#N/A"},{"$error":"#N/A"},{"$error":"#N/A"},{"$error":"#N/A"},{"$error":"#N/A"},{"$error":"#N/A"},{"$error":"#N/A"},{"$error":"#N/A"},{"$error":"#N/A"}]
[null,"Vegetables (small)",30,30,20,10,90,0.7,1.05,0.95,null,15,0,0,0,0,0,{"$error":"#N/A"},{"$error":"#N/A"},{"$error":"#N/A"},{"$error":"#N/A"},{"$error":"#N/A"},{"$error":"#N/A"},{"$error":"#N/A"},{"$error":"#N/A"},{"$error":"#N/A"},{"$error":"#N/A"}]
[null,"Watermelon",20,30,30,30,110,0.4,1,0.75,null,16,0,0,0,0,0,{"$error":"#N/A"},{"$error":"#N/A"},{"$error":"#N/A"},{"$error":"#N/A"},{"$error":"#N/A"},{"$error":"#N/A"},{"$error":"#N/A"},{"$error":"#N/A"},{"$error":"#N/A"},{"$error":"#N/A"}]
[null,"Tobacco",20,20,30,20,90,0.3,1,0.5,null,17,0,0,0,0,0,{"$error":"#N/A"},{"$error":"#N/A"},{"$error":"#N/A"},{"$error":"#N/A"},{"$error":"#N/A"},{"$error":"#N/A"},{"$error":"#N/A"},{"$error":"#N/A"},{"$error":"#N/A"},{"$error":"#N/A"}]
[null,"Sweet Potato",15,30,50,35,130,0.5,1.1499999999999999,0.65,null,18,0,0,0,0,0,{"$error":"#N/A"},{"$error":"#N/A"},{"$error":"#N/A"},{"$error":"#N/A"},{"$error":"#N/A"},{"$error":"#N/A"},{"$error":"#N/A"},{"$error":"#N/A"},{"$error":"#N/A"},{"$error":"#N/A"}]
[null,"Strawberries",20,120,75,35,250,0.4,0.85,0.75,null,19,0,0,0,0,0,{"$error":"#N/A"},{"$error":"#N/A"},{"$error":"#N/A"},{"$error":"#N/A"},{"$error":"#N/A"},{"$error":"#N/A"},{"$error":"#N/A"},{"$error":"#N/A"},{"$error":"#N/A"},{"$error":"#N/A"}]
[null,null,null,null,null,null,null,null,null,null,null,20,0,0,0,0,0,{"$error":"#N/A"},{"$error":"#N/A"},{"$error":"#N/A"},{"$error":"#N/A"},{"$error":"#N/A"},{"$error":"#N/A"},{"$error":"#N/A"},{"$error":"#N/A"},{"$error":"#N/A"},{"$error":"#N/A"}]
[null,{"$f":"+Crop1","v":"Corn (sweet)"},{"$f":"IF(ISNA(variables!C13),0,VLOOKUP(Crop1,kcs!$B$2:$J$20,2,0))","v":20},{"$f":"IF(ISNA(variables!C14),0,VLOOKUP(Crop1,kcs!$B$2:$J$20,3,0))","v":20},{"$f":"IF(ISNA(variables!C15),0,VLOOKUP(Crop1,kcs!$B$2:$J$20,4,0))","v":30},{"$f":"IF(ISNA(variables!C16),0,VLOOKUP(Crop1,kcs!$B$2:$J$20,5,0))","v":10},{"$f":"IF(ISNA(variables!C17),0,VLOOKUP(Crop1,kcs!$B$2:$J$20,6,0))","v":80},{"$f":"IF(Crop1=\"NULL\",0,VLOOKUP(Crop1,kcs!$B$2:$J$20,7,FALSE))","v":0.3},{"$f":"IF(Crop1=\"NULL\",0,VLOOKUP(Crop1,kcs!$B$2:$J$20,8,FALSE))","v":1.1499999999999999},{"$f":"IF(Crop1=\"NULL\",0,VLOOKUP(Crop1,kcs!$B$2:$J$20,9,FALSE))","v":1.05},null,21,0,0,0,0,0,{"$error":"#N/A"},{"$error":"#N/A"},{"$error":"#N/A"},{"$error":"#N/A"},{"$error":"#N/A"},{"$error":"#N/A"},{"$error":"#N/A"},{"$error":"#N/A"},{"$error":"#N/A"},{"$error":"#N/A"}]
[null,{"$f":"+Crop2","v":0},{"$f":"IF(ISNA(variables!D13),0,VLOOKUP(Crop2,kcs!$B$2:$J$20,2,0))","v":{"$error":"#N/A"}},{"$f":"IF(ISNA(variables!D14),0,VLOOKUP(Crop2,kcs!$B$2:$J$20,3,0))","v":{"$error":"#N/A"}},{"$f":"IF(ISNA(variables!D15),0,VLOOKUP(Crop2,kcs!$B$2:$J$20,4,0))","v":{"$error":"#N/A"}},{"$f":"IF(ISNA(variables!D16),0,VLOOKUP(Crop2,kcs!$B$2:$J$20,5,0))","v":{"$error":"#N/A"}},{"$f":"IF(ISNA(variables!D17),0,VLOOKUP(Crop2,kcs!$B$2:$J$20,6,0))","v":{"$error":"#N/A"}},{"$f":"IF(Crop2=\"NULL\",0,VLOOKUP(Crop2,kcs!$B$2:$J$20,7,0))","v":{"$error":"#N/A"}},{"$f":"IF(Crop2=\"NULL\",0,VLOOKUP(Crop2,kcs!$B$2:$J$20,8,FALSE))","v":{"$error":"#N/A"}},{"$f":"IF(Crop2=\"NULL\",0,VLOOKUP(Crop2,kcs!$B$2:$J$20,9,FALSE))","v":{"$error":"#N/A"}},null,22,0,0,0,0,0,{"$error":"#N/A"},{"$error":"#N/A"},{"$error":"#N/A"},{"$error":"#N/A"},{"$error":"#N/A"},{"$error":"#N/A"},{"$error":"#N/A"},{"$error":"#N/A"},{"$error":"#N/A"},{"$error":"#N/A"}]
[null,{"$f":"IF(Crop3=\"\",\"NULL\",+Crop3)","v":"NULL"},{"$f":"IF(ISNA(variables!E13),0,VLOOKUP(Crop3,kcs!$B$2:$J$20,2,0))","v":{"$error":"#N/A"}},{"$f":"IF(ISNA(variables!E14),0,VLOOKUP(Crop3,kcs!$B$2:$J$20,3,0))","v":{"$error":"#N/A"}},{"$f":"IF(ISNA(variables!E15),0,VLOOKUP(Crop3,kcs!$B$2:$J$20,4,0))","v":{"$error":"#N/A"}},{"$f":"IF(ISNA(variables!E16),0,VLOOKUP(Crop3,kcs!$B$2:$J$20,5,0))","v":{"$error":"#N/A"}},{"$f":"IF(ISNA(variables!E17),0,VLOOKUP(Crop3,kcs!$B$2:$J$20,6,0))","v":{"$error":"#N/A"}},{"$f":"IF(Crop3=\"NULL\",0,VLOOKUP(Crop3,kcs!$B$2:$J$20,7,0))","v":{"$error":"#N/A"}},{"$f":"IF(Crop3=\"NULL\",0,VLOOKUP(Crop3,kcs!$B$2:$J$20,8,FALSE))","v":{"$error":"#N/A"}},{"$f":"IF(Crop3=\"NULL\",0,VLOOKUP(Crop3,kcs!$B$2:$J$20,9,FALSE))","v":{"$error":"#N/A"}},null,23,0,0,0,0,0,{"$error":"#N/A"},{"$error":"#N/A"},{"$error":"#N/A"},{"$error":"#N/A"},{"$error":"#N/A"},{"$error":"#N/A"},{"$error":"#N/A"},{"$error":"#N/A"},{"$error":"#N/A"},{"$error":"#N/A"}]
[null,null,null,null,null,null,null,null,null,null,null,24,0,0,0,0,0,{"$error":"#N/A"},{"$error":"#N/A"},{"$error":"#N/A"},{"$error":"#N/A"},{"$error":"#N/A"},{"$error":"#N/A"},{"$error":"#N/A"},{"$error":"#N/A"},{"$error":"#N/A"},{"$error":"#N/A"}]
[null,null,null,null,null,null,null,null,null,null,null,25,0,0,0,0,0,{"$error":"#N/A"},{"$error":"#N/A"},{"$error":"#N/A"},{"$error":"#N/A"},{"$error":"#N/A"},{"$error":"#N/A"},{"$error":"#N/A"},{"$error":"#N/A"},{"$error":"#N/A"},{"$error":"#N/A"}]
[null,null,null,null,null,null,null,null,null,null,null,26,0,0,0,0,0,{"$error":"#N/A"},{"$error":"#N/A"},{"$error":"#N/A"},{"$error":"#N/A"},{"$error":"#N/A"},{"$error":"#N/A"},{"$error":"#N/A"},{"$error":"#N/A"},{"$error":"#N/A"},{"$error":"#N/A"}]
[null,null,null,null,null,null,null,null,null,null,null,27,0,0,0,0,0,{"$error":"#N/A"},{"$error":"#N/A"},{"$error":"#N/A"},{"$error":"#N/A"},{"$error":"#N/A"},{"$error":"#N/A"},{"$error":"#N/A"},{"$error":"#N/A"},{"$error":"#N/A"},{"$error":"#N/A"}]
[null,null,null,null,null,null,null,null,null,null,null,28,0,0,0,0,0,{"$error":"#N/A"},{"$error":"#N/A"},{"$error":"#N/A"},{"$error":"#N/A"},{"$error":"#N/A"},{"$error":"#N/A"},{"$error":"#N/A"},{"$error":"#N/A"},{"$error":"#N/A"},{"$error":"#N/A"}]
[null,null,null,null,null,null,null,null,null,null,null,29,0,0,0,0,0,{"$error":"#N/A"},{"$error":"#N/A"},{"$error":"#N/A"},{"$error":"#N/A"},{"$error":"#N/A"},{"$error":"#N/A"},{"$error":"#N/A"},{"$error":"#N/A"},{"$error":"#N/A"},{"$error":"#N/A"}]
[null,null,null,null,null,null,null,null,null,null,null,30,0,0,0,0,0,{"$error":"#N/A"},{"$error":"#N/A"},{"$error":"#N/A"},{"$error":"#N/A"},{"$error":"#N/A"},{"$error":"#N/A"},{"$error":"#N/A"},{"$error":"#N/A"},{"$error":"#N/A"},{"$error":"#N/A"}]
[null,null,null,null,null,null,null,null,null,null,null,31,0,0,0,0,0,{"$error":"#N/A"},{"$error":"#N/A"},{"$error":"#N/A"},{"$error":"#N/A"},{"$error":"#N/A"},{"$error":"#N/A"},{"$error":"#N/A"},{"$error":"#N/A"},{"$error":"#N/A"},{"$error":"#N/A"}]
[null,null,null,null,null,null,null,null,null,null,null,32,0,0,0,0,0,{"$error":"#N/A"},{"$error":"#N/A"},{"$error":"#N/A"},{"$error":"#N/A"},{"$error":"#N/A"},{"$error":"#N/A"},{"$error":"#N/A"},{"$error":"#N/A"},{"$error":"#N/A"},{"$error":"#N/A"}]
[null,null,null,null,null,null,null,null,null,null,null,33,0,0,0,0,0,{"$error":"#N/A"},{"$error":"#N/A"},{"$error":"#N/A"},{"$error":"#N/A"},{"$error":"#N/A"},{"$error":"#N/A"},{"$error":"#N/A"},{"$error":"#N/A"},{"$error":"#N/A"},{"$error":"#N/A"}]
[null,null,null,null,null,null,null,null,null,null,null,34,0,0,0,0,0,{"$error":"#N/A"},{"$error":"#N/A"},{"$error":"#N/A"},{"$error":"#N/A"},{"$error":"#N/A"},{"$error":"#N/A"},{"$error":"#N/A"},{"$error":"#N/A"},{"$error":"#N/A"},{"$error":"#N/A"}]
[null,null,null,null,null,null,null,null,null,null,null,35,0,0,0,0,0,{"$error":"#N/A"},{"$error":"#N/A"},{"$error":"#N/A"},{"$error":"#N/A"},{"$error":"#N/A"},{"$error":"#N/A"},{"$error":"#N/A"},{"$error":"#N/A"},{"$error":"#N/A"},{"$error":"#N/A"}]
[null,null,null,null,null,null,null,null,null,null,null,36,0,0,0,0,0,{"$error":"#N/A"},{"$error":"#N/A"},{"$error":"#N/A"},{"$error":"#N/A"},{"$error":"#N/A"},{"$error":"#N/A"},{"$error":"#N/A"},{"$error":"#N/A"},{"$error":"#N/A"},{"$error":"#N/A"}]
[null,null,null,null,null,null,null,null,null,null,null,37,0,0,0,0,0,{"$error":"#N/A"},{"$error":"#N/A"},{"$error":"#N/A"},{"$error":"#N/A"},{"$error":"#N/A"},{"$error":"#N/A"},{"$error":"#N/A"},{"$error":"#N/A"},{"$error":"#N/A"},{"$error":"#N/A"}]
[null,null,null,null,null,null,null,null,null,null,null,38,0,0,0,0,0,{"$error":"#N/A"},{"$error":"#N/A"},{"$error":"#N/A"},{"$error":"#N/A"},{"$error":"#N/A"},{"$error":"#N/A"},{"$error":"#N/A"},{"$error":"#N/A"},{"$error":"#N/A"},{"$error":"#N/A"}]
[null,null,null,null,null,null,null,null,null,null,null,39,0,0,0,0,0,{"$error":"#N/A"},{"$error":"#N/A"},{"$error":"#N/A"},{"$error":"#N/A"},{"$error":"#N/A"},{"$error":"#N/A"},{"$error":"#N/A"},{"$error":"#N/A"},{"$error":"#N/A"},{"$error":"#N/A"}]
[null,null,null,null,null,null,null,null,null,null,null,40,0,0,0,0,0,{"$error":"#N/A"},{"$error":"#N/A"},{"$error":"#N/A"},{"$error":"#N/A"},{"$error":"#N/A"},{"$error":"#N/A"},{"$error":"#N/A"},{"$error":"#N/A"},{"$error":"#N/A"},{"$error":"#N/A"}]
[null,null,null,null,null,null,null,null,null,null,null,41,0,0,0,0,0,{"$error":"#N/A"},{"$error":"#N/A"},{"$error":"#N/A"},{"$error":"#N/A"},{"$error":"#N/A"},{"$error":"#N/A"},{"$error":"#N/A"},{"$error":"#N/A"},{"$error":"#N/A"},{"$error":"#N/A"}]
[null,null,null,null,null,null,null,null,null,null,null,42,0,0,0,0,0,{"$error":"#N/A"},{"$error":"#N/A"},{"$error":"#N/A"},{"$error":"#N/A"},{"$error":"#N/A"},{"$error":"#N/A"},{"$error":"#N/A"},{"$error":"#N/A"},{"$error":"#N/A"},{"$error":"#N/A"}]
[null,null,null,null,null,null,null,null,null,null,null,43,0,0,0,0,0,{"$error":"#N/A"},{"$error":"#N/A"},{"$error":"#N/A"},{"$error":"#N/A"},{"$error":"#N/A"},{"$error":"#N/A"},{"$error":"#N/A"},{"$error":"#N/A"},{"$error":"#N/A"},{"$error":"#N/A"}]
[null,null,null,null,null,null,null,null,null,null,null,44,0,0,0,0,0,{"$error":"#N/A"},{"$error":"#N/A"},{"$error":"#N/A"},{"$error":"#N/A"},{"$error":"#N/A"},{"$error":"#N/A"},{"$error":"#N/A"},{"$error":"#N/A"},{"$error":"#N/A"},{"$error":"#N/A"}]
[null,null,null,null,null,null,null,null,null,null,null,45,0,0,0,0,0,{"$error":"#N/A"},{"$error":"#N/A"},{"$error":"#N/A"},{"$error":"#N/A"},{"$error":"#N/A"},{"$error":"#N/A"},{"$error":"#N/A"},{"$error":"#N/A"},{"$error":"#N/A"},{"$error":"#N/A"}]
[null,null,null,null,null,null,null,null,null,null,null,46,0,0,0,0,0,{"$error":"#N/A"},{"$error":"#N/A"},{"$error":"#N/A"},{"$error":"#N/A"},{"$error":"#N/A"},{"$error":"#N/A"},{"$error":"#N/A"},{"$error":"#N/A"},{"$error":"#N/A"},{"$error":"#N/A"}]
[null,null,null,null,null,null,null,null,null,null,null,47,0,0,0,0,0,{"$error":"#N/A"},{"$error":"#N/A"},{"$error":"#N/A"},{"$error":"#N/A"},{"$error":"#N/A"},{"$error":"#N/A"},{"$error":"#N/A"},{"$error":"#N/A"},{"$error":"#N/A"},{"$error":"#N/A"}]
[null,null,null,null,null,null,null,null,null,null,null,48,0,0,0,0,0,{"$error":"#N/A"},{"$error":"#N/A"},{"$error":"#N/A"},{"$error":"#N/A"},{"$error":"#N/A"},{"$error":"#N/A"},{"$error":"#N/A"},{"$error":"#N/A"},{"$error":"#N/A"},{"$error":"#N/A"}]
[null,null,null,null,null,null,null,null,null,null,null,49,0,0,0,0,0,{"$error":"#N/A"},{"$error":"#N/A"},{"$error":"#N/A"},{"$error":"#N/A"},{"$error":"#N/A"},{"$error":"#N/A"},{"$error":"#N/A"},{"$error":"#N/A"},{"$error":"#N/A"},{"$error":"#N/A"}]
[null,null,null,null,null,null,null,null,null,null,null,50,0,0,0,0,0,{"$error":"#N/A"},{"$error":"#N/A"},{"$error":"#N/A"},{"$error":"#N/A"},{"$error":"#N/A"},{"$error":"#N/A"},{"$error":"#N/A"},{"$error":"#N/A"},{"$error":"#N/A"},{"$error":"#N/A"}]
[null,null,null,null,null,null,null,null,null,null,null,51,0,0,0,0,0,{"$error":"#N/A"},{"$error":"#N/A"},{"$error":"#N/A"},{"$error":"#N/A"},{"$error":"#N/A"},{"$error":"#N/A"},{"$error":"#N/A"},{"$error":"#N/A"},{"$error":"#N/A"},{"$error":"#N/A"}]
[null,null,null,null,null,null,null,null,null,null,null,52,0,0,0,0,0,{"$error":"#N/A"},{"$error":"#N/A"},{"$error":"#N/A"},{"$error":"#N/A"},{"$error":"#N/A"},{"$error":"#N/A"},{"$error":"#N/A"},{"$error":"#N/A"},{"$error":"#N/A"},{"$error":"#N/A"}]
[null,null,null,null,null,null,null,null,null,null,null,53,0,0,0,0,0,{"$error":"#N/A"},{"$error":"#N/A"},{"$error":"#N/A"},{"$error":"#N/A"},{"$error":"#N/A"},{"$error":"#N/A"},{"$error":"#N/A"},{"$error":"#N/A"},{"$error":"#N/A"},{"$error":"#N/A"}]
[null,null,null,null,null,null,null,null,null,null,null,54,0,0,0,0,0,{"$error":"#N/A"},{"$error":"#N/A"},{"$error":"#N/A"},{"$error":"#N/A"},{"$error":"#N/A"},{"$error":"#N/A"},{"$error":"#N/A"},{"$error":"#N/A"},{"$error":"#N/A"},{"$error":"#N/A"}]
[null,null,null,null,null,null,null,null,null,null,null,55,0,0,0,0,0,{"$error":"#N/A"},{"$error":"#N/A"},{"$error":"#N/A"},{"$error":"#N/A"},{"$error":"#N/A"},{"$error":"#N/A"},{"$error":"#N/A"},{"$error":"#N/A"},{"$error":"#N/A"},{"$error":"#N/A"}]
[null,null,null,null,null,null,null,null,null,null,null,56,0,0,0,0,0,{"$error":"#N/A"},{"$error":"#N/A"},{"$error":"#N/A"},{"$error":"#N/A"},{"$error":"#N/A"},{"$error":"#N/A"},{"$error":"#N/A"},{"$error":"#N/A"},{"$error":"#N/A"},{"$error":"#N/A"}]
[null,null,null,null,null,null,null,null,null,null,null,57,0,0,0,0,0,{"$error":"#N/A"},{"$error":"#N/A"},{"$error":"#N/A"},{"$error":"#N/A"},{"$error":"#N/A"},{"$error":"#N/A"},{"$error":"#N/A"},{"$error":"#N/A"},{"$error":"#N/A"},{"$error":"#N/A"}]
[null,null,null,null,null,null,null,null,null,null,null,58,0,0,0,0,0,{"$error":"#N/A"},{"$error":"#N/A"},{"$error":"#N/A"},{"$error":"#N/A"},{"$error":"#N/A"},{"$error":"#N/A"},{"$error":"#N/A"},{"$error":"#N/A"},{"$error":"#N/A"},{"$error":"#N/A"}]
[null,null,null,null,null,null,null,null,null,null,null,59,0,0,0,0,0,{"$error":"#N/A"},{"$error":"#N/A"},{"$error":"#N/A"},{"$error":"#N/A"},{"$error":"#N/A"},{"$error":"#N/A"},{"$error":"#N/A"},{"$error":"#N/A"},{"$error":"#N/A"},{"$error":"#N/A"}]
[null,null,null,null,null,null,null,null,null,null,null,60,0,0,0,0,0,{"$error":"#N/A"},{"$error":"#N/A"},{"$error":"#N/A"},{"$error":"#N/A"},{"$error":"#N/A"},{"$error":"#N/A"},{"$error":"#N/A"},{"$error":"#N/A"},{"$error":"#N/A"},{"$error":"#N/A"}]
[null,null,null,null,null,null,null,null,null,null,null,61,0,0,0,0,0,{"$error":"#N/A"},{"$error":"#N/A"},{"$error":"#N/A"},{"$error":"#N/A"},{"$error":"#N/A"},{"$error":"#N/A"},{"$error":"#N/A"},{"$error":"#N/A"},{"$error":"#N/A"},{"$error":"#N/A"}]
[null,null,null,null,null,null,null,null,null,null,null,62,0,0,0,0,0,{"$error":"#N/A"},{"$error":"#N/A"},{"$error":"#N/A"},{"$error":"#N/A"},{"$error":"#N/A"},{"$error":"#N/A"},{"$error":"#N/A"},{"$error":"#N/A"},{"$error":"#N/A"},{"$error":"#N/A"}]
[null,null,null,null,null,null,null,null,null,null,null,63,0,0,0,0,0,{"$error":"#N/A"},{"$error":"#N/A"},{"$error":"#N/A"},{"$error":"#N/A"},{"$error":"#N/A"},{"$error":"#N/A"},{"$error":"#N/A"},{"$error":"#N/A"},{"$error":"#N/A"},{"$error":"#N/A"}]
[null,null,null,null,null,null,null,null,null,null,null,64,0,0,0,0,0,{"$error":"#N/A"},{"$error":"#N/A"},{"$error":"#N/A"},{"$error":"#N/A"},{"$error":"#N/A"},{"$error":"#N/A"},{"$error":"#N/A"},{"$error":"#N/A"},{"$error":"#N/A"},{"$error":"#N/A"}]
[null,null,null,null,null,null,null,null,null,null,null,65,{"$f":"MAX(IF(OR(kcjd<jdplant1,kcjd>jdplant1+C$22),0,kc.ini.1),M431)","v":0},{"$f":"MAX(IF(OR(kcjd<jdplant1+C$22,kcjd>jdplant1+SUM(C$22,D$22)),0,+H$22+(kcjd-(jdplant1+C$22))/(jdplant1+SUM(C$22,D$22)-(jdplant1+C$22))*(I$22-H$22)),N431)","v":0},{"$f":"MAX(IF(OR(kcjd<jdplant1+SUM(C$22,D$22),kcjd>jdplant1+SUM(C$22,D$22,E$22)),0,kc.mid.1),O431)","v":0},{"$f":"MAX(IF(OR(kcjd<jdplant1+SUM(C$22:E$22),kcjd>jdplant1+G$22),0,+I$22-(kcjd-(jdplant1+SUM(C$22:E$22)))/((jdplant1+G$22)-(jdplant1+SUM(C$22:E$22)))*(I$22-J$22)),P431)","v":0},0,{"$f":"MAX(IF(OR(kcjd<jdplant2,kcjd>jdplant2+$C$23),0,kc.ini.2),R431)","v":{"$error":"#N/A"}},{"$f":"MAX(IF(OR(kcjd<jdplant2+$C$23,kcjd>jdplant2+SUM($C$23,$D$23)),0,+kc.ini.2+(kcjd-(jdplant2+$C$23))/(jdplant2+SUM($C$23,$D$23)-(jdplant2+$C$23))*(kc.mid.2-kc.ini.2)),S431)","v":{"$error":"#N/A"}},{"$f":"MAX(IF(OR(kcjd<jdplant2+SUM($C$23,$D$23),kcjd>jdplant2+SUM($C$23,$D$23,$E$23)),0,kc.mid.2),T431)","v":{"$error":"#N/A"}},{"$f":"MAX(IF(OR(kcjd<jdplant2+SUM($C$23:$E$23),kcjd>jdplant2+$G$23),0,+kc.mid.2-(kcjd-(jdplant2+SUM($C$23:$E$23)))/((jdplant2+$G$23)-(jdplant2+SUM($C$23:$E$23)))*(kc.mid.2-kc.late.2)),U431)","v":{"$error":"#N/A"}},{"$error":"#N/A"},{"$f":"MAX(IF(OR(kcjd<jdplant3,kcjd>jdplant3+$C$24),0,kc.ini.3),W431)","v":{"$error":"#N/A"}},{"$f":"MAX(IF(OR(kcjd<jdplant3+$C$24,kcjd>jdplant3+SUM($C$24,$D$24)),0,+kc.ini.3+(kcjd-(jdplant3+$C$24))/(jdplant3+SUM($C$24,$D$24)-(jdplant3+$C$24))*(kc.mid.3-kc.ini.3)),X431)","v":{"$error":"#N/A"}},{"$f":"MAX(IF(OR(kcjd<jdplant3+SUM($C$24,$D$24),kcjd>jdplant3+SUM($C$24,$D$24,$E$24)),0,kc.mid.3),Y431)","v":{"$error":"#N/A"}},{"$f":"MAX(IF(OR(kcjd<jdplant3+SUM($C$24:$E$24),kcjd>jdplant3+$G$24),0,+kc.mid.3-(kcjd-(jdplant3+SUM($C$24:$E$24)))/((jdplant3+$G$24)-(jdplant3+SUM($C$24:$E$24)))*(kc.mid.3-kc.late.3)),Z431)","v":{"$error":"#N/A"}},{"$error":"#N/A"}]
[null,null,null,null,null,null,null,null,null,null,null,66,0,0,0,0,{"$f":"MAX(M67:P67)","v":0},{"$error":"#N/A"},{"$error":"#N/A"},{"$error":"#N/A"},{"$error":"#N/A"},{"$f":"MAX(R67:U67)","v":{"$error":"#N/A"}},{"$error":"#N/A"},{"$error":"#N/A"},{"$error":"#N/A"},{"$error":"#N/A"},{"$f":"MAX(W67:Z67)","v":{"$error":"#N/A"}}]
[null,null,null,null,null,null,null,null,null,null,null,67,0,0,0,0,0,{"$error":"#N/A"},{"$error":"#N/A"},{"$error":"#N/A"},{"$error":"#N/A"},{"$error":"#N/A"},{"$error":"#N/A"},{"$error":"#N/A"},{"$error":"#N/A"},{"$error":"#N/A"},{"$error":"#N/A"}]
[null,null,null,null,null,null,null,null,null,null,null,68,0,0,0,0,0,{"$error":"#N/A"},{"$error":"#N/A"},{"$error":"#N/A"},{"$error":"#N/A"},{"$error":"#N/A"},{"$error":"#N/A"},{"$error":"#N/A"},{"$error":"#N/A"},{"$error":"#N/A"},{"$error":"#N/A"}]
[null,null,null,null,null,null,null,null,null,null,null,69,0,0,0,0,0,{"$error":"#N/A"},{"$error":"#N/A"},{"$error":"#N/A"},{"$error":"#N/A"},{"$error":"#N/A"},{"$error":"#N/A"},{"$error":"#N/A"},{"$error":"#N/A"},{"$error":"#N/A"},{"$error":"#N/A"}]
[null,null,null,null,null,null,null,null,null,null,null,70,0,0,0,0,0,{"$error":"#N/A"},{"$error":"#N/A"},{"$error":"#N/A"},{"$error":"#N/A"},{"$error":"#N/A"},{"$error":"#N/A"},{"$error":"#N/A"},{"$error":"#N/A"},{"$error":"#N/A"},{"$error":"#N/A"}]
[null,null,null,null,null,null,null,null,null,null,null,71,0,0,0,0,0,{"$error":"#N/A"},{"$error":"#N/A"},{"$error":"#N/A"},{"$error":"#N/A"},{"$error":"#N/A"},{"$error":"#N/A"},{"$error":"#N/A"},{"$error":"#N/A"},{"$error":"#N/A"},{"$error":"#N/A"}]
[null,null,null,null,null,null,null,null,null,null,null,72,0,0,0,0,0,{"$error":"#N/A"},{"$error":"#N/A"},{"$error":"#N/A"},{"$error":"#N/A"},{"$error":"#N/A"},{"$error":"#N/A"},{"$error":"#N/A"},{"$error":"#N/A"},{"$error":"#N/A"},{"$error":"#N/A"}]
[null,null,null,null,null,null,null,null,null,null,null,73,0,0,0,0,0,{"$error":"#N/A"},{"$error":"#N/A"},{"$error":"#N/A"},{"$error":"#N/A"},{"$error":"#N/A"},{"$error":"#N/A"},{"$error":"#N/A"},{"$error":"#N/A"},{"$error":"#N/A"},{"$error":"#N/A"}]
[null,null,null,null,null,null,null,null,null,null,null,74,0,0,0,0,0,{"$error":"#N/A"},{"$error":"#N/A"},{"$error":"#N/A"},{"$error":"#N/A"},{"$error":"#N/A"},{"$error":"#N/A"},{"$error":"#N/A"},{"$error":"#N/A"},{"$error":"#N/A"},{"$error":"#N/A"}]
[null,null,null,null,null,null,null,null,null,null,null,75,0,0,0,0,0,{"$error":"#N/A"},{"$error":"#N/A"},{"$error":"#N/A"},{"$error":"#N/A"},{"$error":"#N/A"},{"$error":"#N/A"},{"$error":"#N/A"},{"$error":"#N/A"},{"$error":"#N/A"},{"$error":"#N/A"}]
[null,null,null,null,null,null,null,null,null,null,null,76,0,0,0,0,0,{"$error":"#N/A"},{"$error":"#N/A"},{"$error":"#N/A"},{"$error":"#N/A"},{"$error":"#N/A"},{"$error":"#N/A"},{"$error":"#N/A"},{"$error":"#N/A"},{"$error":"#N/A"},{"$error":"#N/A"}]
[null,null,null,null,null,null,null,null,null,null,null,77,0,0,0,0,0,{"$error":"#N/A"},{"$error":"#N/A"},{"$error":"#N/A"},{"$error":"#N/A"},{"$error":"#N/A"},{"$error":"#N/A"},{"$error":"#N/A"},{"$error":"#N/A"},{"$error":"#N/A"},{"$error":"#N/A"}]
[null,null,null,null,null,null,null,null,null,null,null,78,0,0,0,0,0,{"$error":"#N/A"},{"$error":"#N/A"},{"$error":"#N/A"},{"$error":"#N/A"},{"$error":"#N/A"},{"$error":"#N/A"},{"$error":"#N/A"},{"$error":"#N/A"},{"$error":"#N/A"},{"$error":"#N/A"}]
[null,null,null,null,null,null,null,null,null,null,null,79,0,0,0,0,0,{"$error":"#N/A"},{"$error":"#N/A"},{"$error":"#N/A"},{"$error":"#N/A"},{"$error":"#N/A"},{"$error":"#N/A"},{"$error":"#N/A"},{"$error":"#N/A"},{"$error":"#N/A"},{"$error":"#N/A"}]
[null,null,null,null,null,null,null,null,null,null,null,80,0,0,0,0,0,{"$error":"#N/A"},{"$error":"#N/A"},{"$error":"#N/A"},{"$error":"#N/A"},{"$error":"#N/A"},{"$error":"#N/A"},{"$error":"#N/A"},{"$error":"#N/A"},{"$error":"#N/A"},{"$error":"#N/A"}]
[null,null,null,null,null,null,null,null,null,null,null,81,0,0,0,0,0,{"$error":"#N/A"},{"$error":"#N/A"},{"$error":"#N/A"},{"$error":"#N/A"},{"$error":"#N/A"},{"$error":"#N/A"},{"$error":"#N/A"},{"$error":"#N/A"},{"$error":"#N/A"},{"$error":"#N/A"}]
[null,null,null,null,null,null,null,null,null,null,null,82,0,0,0,0,0,{"$error":"#N/A"},{"$error":"#N/A"},{"$error":"#N/A"},{"$error":"#N/A"},{"$error":"#N/A"},{"$error":"#N/A"},{"$error":"#N/A"},{"$error":"#N/A"},{"$error":"#N/A"},{"$error":"#N/A"}]
[null,null,null,null,null,null,null,null,null,null,null,83,0,0,0,0,0,{"$error":"#N/A"},{"$error":"#N/A"},{"$error":"#N/A"},{"$error":"#N/A"},{"$error":"#N/A"},{"$error":"#N/A"},{"$error":"#N/A"},{"$error":"#N/A"},{"$error":"#N/A"},{"$error":"#N/A"}]
[null,null,null,null,null,null,null,null,null,null,null,84,0,0,0,0,0,{"$error":"#N/A"},{"$error":"#N/A"},{"$error":"#N/A"},{"$error":"#N/A"},{"$error":"#N/A"},{"$error":"#N/A"},{"$error":"#N/A"},{"$error":"#N/A"},{"$error":"#N/A"},{"$error":"#N/A"}]
[null,null,null,null,null,null,null,null,null,null,null,85,0,0,0,0,0,{"$error":"#N/A"},{"$error":"#N/A"},{"$error":"#N/A"},{"$error":"#N/A"},{"$error":"#N/A"},{"$error":"#N/A"},{"$error":"#N/A"},{"$error":"#N/A"},{"$error":"#N/A"},{"$error":"#N/A"}]
[null,null,null,null,null,null,null,null,null,null,null,86,0,0,0,0,0,{"$error":"#N/A"},{"$error":"#N/A"},{"$error":"#N/A"},{"$error":"#N/A"},{"$error":"#N/A"},{"$error":"#N/A"},{"$error":"#N/A"},{"$error":"#N/A"},{"$error":"#N/A"},{"$error":"#N/A"}]
[null,null,null,null,null,null,null,null,null,null,null,87,0,0,0,0,0,{"$error":"#N/A"},{"$error":"#N/A"},{"$error":"#N/A"},{"$error":"#N/A"},{"$error":"#N/A"},{"$error":"#N/A"},{"$error":"#N/A"},{"$error":"#N/A"},{"$error":"#N/A"},{"$error":"#N/A"}]
[null,null,null,null,null,null,null,null,null,null,null,88,0,0,0,0,0,{"$error":"#N/A"},{"$error":"#N/A"},{"$error":"#N/A"},{"$error":"#N/A"},{"$error":"#N/A"},{"$error":"#N/A"},{"$error":"#N/A"},{"$error":"#N/A"},{"$error":"#N/A"},{"$error":"#N/A"}]
[null,null,null,null,null,null,null,null,null,null,null,89,0,0,0,0,0,{"$error":"#N/A"},{"$error":"#N/A"},{"$error":"#N/A"},{"$error":"#N/A"},{"$error":"#N/A"},{"$error":"#N/A"},{"$error":"#N/A"},{"$error":"#N/A"},{"$error":"#N/A"},{"$error":"#N/A"}]
[null,null,null,null,null,null,null,null,null,null,null,90,0,0,0,0,0,{"$error":"#N/A"},{"$error":"#N/A"},{"$error":"#N/A"},{"$error":"#N/A"},{"$error":"#N/A"},{"$error":"#N/A"},{"$error":"#N/A"},{"$error":"#N/A"},{"$error":"#N/A"},{"$error":"#N/A"}]
[null,null,null,null,null,null,null,null,null,null,null,91,0,0,0,0,0,{"$error":"#N/A"},{"$error":"#N/A"},{"$error":"#N/A"},{"$error":"#N/A"},{"$error":"#N/A"},{"$error":"#N/A"},{"$error":"#N/A"},{"$error":"#N/A"},{"$error":"#N/A"},{"$error":"#N/A"}]
[null,null,null,null,null,null,null,null,null,null,null,92,0,0,0,0,0,{"$error":"#N/A"},{"$error":"#N/A"},{"$error":"#N/A"},{"$error":"#N/A"},{"$error":"#N/A"},{"$error":"#N/A"},{"$error":"#N/A"},{"$error":"#N/A"},{"$error":"#N/A"},{"$error":"#N/A"}]
[null,null,null,null,null,null,null,null,null,null,null,93,0,0,0,0,0,{"$error":"#N/A"},{"$error":"#N/A"},{"$error":"#N/A"},{"$error":"#N/A"},{"$error":"#N/A"},{"$error":"#N/A"},{"$error":"#N/A"},{"$error":"#N/A"},{"$error":"#N/A"},{"$error":"#N/A"}]
[null,null,null,null,null,null,null,null,null,null,null,94,0,0,0,0,0,{"$error":"#N/A"},{"$error":"#N/A"},{"$error":"#N/A"},{"$error":"#N/A"},{"$error":"#N/A"},{"$error":"#N/A"},{"$error":"#N/A"},{"$error":"#N/A"},{"$error":"#N/A"},{"$error":"#N/A"}]
[null,null,null,null,null,null,null,null,null,null,null,95,0,0,0,0,0,{"$error":"#N/A"},{"$error":"#N/A"},{"$error":"#N/A"},{"$error":"#N/A"},{"$error":"#N/A"},{"$error":"#N/A"},{"$error":"#N/A"},{"$error":"#N/A"},{"$error":"#N/A"},{"$error":"#N/A"}]
[null,null,null,null,null,null,null,null,null,null,null,96,0,0,0,0,0,{"$error":"#N/A"},{"$error":"#N/A"},{"$error":"#N/A"},{"$error":"#N/A"},{"$error":"#N/A"},{"$error":"#N/A"},{"$error":"#N/A"},{"$error":"#N/A"},{"$error":"#N/A"},{"$error":"#N/A"}]
[null,null,null,null,null,null,null,null,null,null,null,97,0,0,0,0,0,{"$error":"#N/A"},{"$error":"#N/A"},{"$error":"#N/A"},{"$error":"#N/A"},{"$error":"#N/A"},{"$error":"#N/A"},{"$error":"#N/A"},{"$error":"#N/A"},{"$error":"#N/A"},{"$error":"#N/A"}]
[null,null,null,null,null,null,null,null,null,null,null,98,0,0,0,0,0,{"$error":"#N/A"},{"$error":"#N/A"},{"$error":"#N/A"},{"$error":"#N/A"},{"$error":"#N/A"},{"$error":"#N/A"},{"$error":"#N/A"},{"$error":"#N/A"},{"$error":"#N/A"},{"$error":"#N/A"}]
[null,null,null,null,null,null,null,null,null,null,null,99,0,0,0,0,0,{"$error":"#N/A"},{"$error":"#N/A"},{"$error":"#N/A"},{"$error":"#N/A"},{"$error":"#N/A"},{"$error":"#N/A"},{"$error":"#N/A"},{"$error":"#N/A"},{"$error":"#N/A"},{"$error":"#N/A"}]
[null,null,null,null,null,null,null,null,null,null,null,100,0,0,0,0,0,{"$error":"#N/A"},{"$error":"#N/A"},{"$error":"#N/A"},{"$error":"#N/A"},{"$error":"#N/A"},{"$error":"#N/A"},{"$error":"#N/A"},{"$error":"#N/A"},{"$error":"#N/A"},{"$error":"#N/A"}]
[null,null,null,null,null,null,null,null,null,null,null,101,0,0,0,0,0,{"$error":"#N/A"},{"$error":"#N/A"},{"$error":"#N/A"},{"$error":"#N/A"},{"$error":"#N/A"},{"$error":"#N/A"},{"$error":"#N/A"},{"$error":"#N/A"},{"$error":"#N/A"},{"$error":"#N/A"}]
[null,null,null,null,null,null,null,null,null,null,null,102,0,0,0,0,0,{"$error":"#N/A"},{"$error":"#N/A"},{"$error":"#N/A"},{"$error":"#N/A"},{"$error":"#N/A"},{"$error":"#N/A"},{"$error":"#N/A"},{"$error":"#N/A"},{"$error":"#N/A"},{"$error":"#N/A"}]
[null,null,null,null,null,null,null,null,null,null,null,103,0,0,0,0,0,{"$error":"#N/A"},{"$error":"#N/A"},{"$error":"#N/A"},{"$error":"#N/A"},{"$error":"#N/A"},{"$error":"#N/A"},{"$error":"#N/A"},{"$error":"#N/A"},{"$error":"#N/A"},{"$error":"#N/A"}]
[null,null,null,null,null,null,null,null,null,null,null,104,0,0,0,0,0,{"$error":"#N/A"},{"$error":"#N/A"},{"$error":"#N/A"},{"$error":"#N/A"},{"$error":"#N/A"},{"$error":"#N/A"},{"$error":"#N/A"},{"$error":"#N/A"},{"$error":"#N/A"},{"$error":"#N/A"}]
[null,null,null,null,null,null,null,null,null,null,null,105,0.3,0,0,0,0.3,{"$error":"#N/A"},{"$error":"#N/A"},{"$error":"#N/A"},{"$error":"#N/A"},{"$error":"#N/A"},{"$error":"#N/A"},{"$error":"#N/A"},{"$error":"#N/A"},{"$error":"#N/A"},{"$error":"#N/A"}]
[null,null,null,null,null,null,null,null,null,null,null,106,0.3,0,0,0,0.3,{"$error":"#N/A"},{"$error":"#N/A"},{"$error":"#N/A"},{"$error":"#N/A"},{"$error":"#N/A"},{"$error":"#N/A"},{"$error":"#N/A"},{"$error":"#N/A"},{"$error":"#N/A"},{"$error":"#N/A"}]
[null,null,null,null,null,null,null,null,null,null,null,107,0.3,0,0,0,0.3,{"$error":"#N/A"},{"$error":"#N/A"},{"$error":"#N/A"},{"$error":"#N/A"},{"$error":"#N/A"},{"$error":"#N/A"},{"$error":"#N/A"},{"$error":"#N/A"},{"$error":"#N/A"},{"$error":"#N/A"}]
[null,null,null,null,null,null,null,null,null,null,null,108,0.3,0,0,0,0.3,{"$error":"#N/A"},{"$error":"#N/A"},{"$error":"#N/A"},{"$error":"#N/A"},{"$error":"#N/A"},{"$error":"#N/A"},{"$error":"#N/A"},{"$error":"#N/A"},{"$error":"#N/A"},{"$error":"#N/A"}]
[null,null,null,null,null,null,null,null,null,null,null,109,0.3,0,0,0,0.3,{"$error":"#N/A"},{"$error":"#N/A"},{"$error":"#N/A"},{"$error":"#N/A"},{"$error":"#N/A"},{"$error":"#N/A"},{"$error":"#N/A"},{"$error":"#N/A"},{"$error":"#N/A"},{"$error":"#N/A"}]
[null,null,null,null,null,null,null,null,null,null,null,110,0.3,0,0,0,0.3,{"$error":"#N/A"},{"$error":"#N/A"},{"$error":"#N/A"},{"$error":"#N/A"},{"$error":"#N/A"},{"$error":"#N/A"},{"$error":"#N/A"},{"$error":"#N/A"},{"$error":"#N/A"},{"$error":"#N/A"}]
[null,null,null,null,null,null,null,null,null,null,null,111,0.3,0,0,0,0.3,{"$error":"#N/A"},{"$error":"#N/A"},{"$error":"#N/A"},{"$error":"#N/A"},{"$error":"#N/A"},{"$error":"#N/A"},{"$error":"#N/A"},{"$error":"#N/A"},{"$error":"#N/A"},{"$error":"#N/A"}]
[null,null,null,null,null,null,null,null,null,null,null,112,0.3,0,0,0,0.3,{"$error":"#N/A"},{"$error":"#N/A"},{"$error":"#N/A"},{"$error":"#N/A"},{"$error":"#N/A"},{"$error":"#N/A"},{"$error":"#N/A"},{"$error":"#N/A"},{"$error":"#N/A"},{"$error":"#N/A"}]
[null,null,null,null,null,null,null,null,null,null,null,113,0.3,0,0,0,0.3,{"$error":"#N/A"},{"$error":"#N/A"},{"$error":"#N/A"},{"$error":"#N/A"},{"$error":"#N/A"},{"$error":"#N/A"},{"$error":"#N/A"},{"$error":"#N/A"},{"$error":"#N/A"},{"$error":"#N/A"}]
[null,null,null,null,null,null,null,null,null,null,null,114,0.3,0,0,0,0.3,{"$error":"#N/A"},{"$error":"#N/A"},{"$error":"#N/A"},{"$error":"#N/A"},{"$error":"#N/A"},{"$error":"#N/A"},{"$error":"#N/A"},{"$error":"#N/A"},{"$error":"#N/A"},{"$error":"#N/A"}]
[null,null,null,null,null,null,null,null,null,null,null,115,0.3,0,0,0,0.3,{"$error":"#N/A"},{"$error":"#N/A"},{"$error":"#N/A"},{"$error":"#N/A"},{"$error":"#N/A"},{"$error":"#N/A"},{"$error":"#N/A"},{"$error":"#N/A"},{"$error":"#N/A"},{"$error":"#N/A"}]
[null,null,null,null,null,null,null,null,null,null,null,116,0.3,0,0,0,0.3,{"$error":"#N/A"},{"$error":"#N/A"},{"$error":"#N/A"},{"$error":"#N/A"},{"$error":"#N/A"},{"$error":"#N/A"},{"$error":"#N/A"},{"$error":"#N/A"},{"$error":"#N/A"},{"$error":"#N/A"}]
[null,null,null,null,null,null,null,null,null,null,null,117,0.3,0,0,0,0.3,{"$error":"#N/A"},{"$error":"#N/A"},{"$error":"#N/A"},{"$error":"#N/A"},{"$error":"#N/A"},{"$error":"#N/A"},{"$error":"#N/A"},{"$error":"#N/A"},{"$error":"#N/A"},{"$error":"#N/A"}]
[null,null,null,null,null,null,null,null,null,null,null,118,0.3,0,0,0,0.3,{"$error":"#N/A"},{"$error":"#N/A"},{"$error":"#N/A"},{"$error":"#N/A"},{"$error":"#N/A"},{"$error":"#N/A"},{"$error":"#N/A"},{"$error":"#N/A"},{"$error":"#N/A"},{"$error":"#N/A"}]
[null,null,null,null,null,null,null,null,null,null,null,119,0.3,0,0,0,0.3,{"$error":"#N/A"},{"$error":"#N/A"},{"$error":"#N/A"},{"$error":"#N/A"},{"$error":"#N/A"},{"$error":"#N/A"},{"$error":"#N/A"},{"$error":"#N/A"},{"$error":"#N/A"},{"$error":"#N/A"}]
[null,null,null,null,null,null,null,null,null,null,null,120,0.3,0,0,0,0.3,{"$error":"#N/A"},{"$error":"#N/A"},{"$error":"#N/A"},{"$error":"#N/A"},{"$error":"#N/A"},{"$error":"#N/A"},{"$error":"#N/A"},{"$error":"#N/A"},{"$error":"#N/A"},{"$error":"#N/A"}]
[null,null,null,null,null,null,null,null,null,null,null,121,0.3,0,0,0,0.3,{"$error":"#N/A"},{"$error":"#N/A"},{"$error":"#N/A"},{"$error":"#N/A"},{"$error":"#N/A"},{"$error":"#N/A"},{"$error":"#N/A"},{"$error":"#N/A"},{"$error":"#N/A"},{"$error":"#N/A"}]
[null,null,null,null,null,null,null,null,null,null,null,122,0.3,0,0,0,0.3,{"$error":"#N/A"},{"$error":"#N/A"},{"$error":"#N/A"},{"$error":"#N/A"},{"$error":"#N/A"},{"$error":"#N/A"},{"$error":"#N/A"},{"$error":"#N/A"},{"$error":"#N/A"},{"$error":"#N/A"}]
[null,null,null,null,null,null,null,null,null,null,null,123,0.3,0,0,0,0.3,{"$error":"#N/A"},{"$error":"#N/A"},{"$error":"#N/A"},{"$error":"#N/A"},{"$error":"#N/A"},{"$error":"#N/A"},{"$error":"#N/A"},{"$error":"#N/A"},{"$error":"#N/A"},{"$error":"#N/A"}]
[null,null,null,null,null,null,null,null,null,null,null,124,0.3,0,0,0,0.3,{"$error":"#N/A"},{"$error":"#N/A"},{"$error":"#N/A"},{"$error":"#N/A"},{"$error":"#N/A"},{"$error":"#N/A"},{"$error":"#N/A"},{"$error":"#N/A"},{"$error":"#N/A"},{"$error":"#N/A"}]
[null,null,null,null,null,null,null,null,null,null,null,125,0.3,0.3,0,0,0.3,{"$error":"#N/A"},{"$error":"#N/A"},{"$error":"#N/A"},{"$error":"#N/A"},{"$error":"#N/A"},{"$error":"#N/A"},{"$error":"#N/A"},{"$error":"#N/A"},{"$error":"#N/A"},{"$error":"#N/A"}]
[null,null,null,null,null,null,null,null,null,null,null,126,0,0.34249999999999997,0,0,0.34249999999999997,{"$error":"#N/A"},{"$error":"#N/A"},{"$error":"#N/A"},{"$error":"#N/A"},{"$error":"#N/A"},{"$error":"#N/A"},{"$error":"#N/A"},{"$error":"#N/A"},{"$error":"#N/A"},{"$error":"#N/A"}]
[null,null,null,null,null,null,null,null,null,null,null,127,0,0.38500000000000001,0,0,0.38500000000000001,{"$error":"#N/A"},{"$error":"#N/A"},{"$error":"#N/A"},{"$error":"#N/A"},{"$error":"#N/A"},{"$error":"#N/A"},{"$error":"#N/A"},{"$error":"#N/A"},{"$error":"#N/A"},{"$error":"#N/A"}]
[null,null,null,null,null,null,null,null,null,null,null,128,0,0.42749999999999999,0,0,0.42749999999999999,{"$error":"#N/A"},{"$error":"#N/A"},{"$error":"#N/A"},{"$error":"#N/A"},{"$error":"#N/A"},{"$error":"#N/A"},{"$error":"#N/A"},{"$error":"#N/A"},{"$error":"#N/A"},{"$error":"#N/A"}]
[null,null,null,null,null,null,null,null,null,null,null,129,{"$f":"MAX(IF(OR(kcjd<jdplant1,kcjd>jdplant1+C$22),0,kc.ini.1),M495)","v":0},{"$f":"MAX(IF(OR(kcjd<jdplant1+C$22,kcjd>jdplant1+SUM(C$22,D$22)),0,+H$22+(kcjd-(jdplant1+C$22))/(jdplant1+SUM(C$22,D$22)-(jdplant1+C$22))*(I$22-H$22)),N495)","v":0.47},{"$f":"MAX(IF(OR(kcjd<jdplant1+SUM(C$22,D$22),kcjd>jdplant1+SUM(C$22,D$22,E$22)),0,kc.mid.1),O495)","v":0},{"$f":"MAX(IF(OR(kcjd<jdplant1+SUM(C$22:E$22),kcjd>jdplant1+G$22),0,+I$22-(kcjd-(jdplant1+SUM(C$22:E$22)))/((jdplant1+G$22)-(jdplant1+SUM(C$22:E$22)))*(I$22-J$22)),P495)","v":0},0.47,{"$f":"MAX(IF(OR(kcjd<jdplant2,kcjd>jdplant2+$C$23),0,kc.ini.2),R495)","v":{"$error":"#N/A"}},{"$f":"MAX(IF(OR(kcjd<jdplant2+$C$23,kcjd>jdplant2+SUM($C$23,$D$23)),0,+kc.ini.2+(kcjd-(jdplant2+$C$23))/(jdplant2+SUM($C$23,$D$23)-(jdplant2+$C$23))*(kc.mid.2-kc.ini.2)),S495)","v":{"$error":"#N/A"}},{"$f":"MAX(IF(OR(kcjd<jdplant2+SUM($C$23,$D$23),kcjd>jdplant2+SUM($C$23,$D$23,$E$23)),0,kc.mid.2),T495)","v":{"$error":"#N/A"}},{"$f":"MAX(IF(OR(kcjd<jdplant2+SUM($C$23:$E$23),kcjd>jdplant2+$G$23),0,+kc.mid.2-(kcjd-(jdplant2+SUM($C$23:$E$23)))/((jdplant2+$G$23)-(jdplant2+SUM($C$23:$E$23)))*(kc.mid.2-kc.late.2)),U495)","v":{"$error":"#N/A"}},{"$error":"#N/A"},{"$f":"MAX(IF(OR(kcjd<jdplant3,kcjd>jdplant3+$C$24),0,kc.ini.3),W495)","v":{"$error":"#N/A"}},{"$f":"MAX(IF(OR(kcjd<jdplant3+$C$24,kcjd>jdplant3+SUM($C$24,$D$24)),0,+kc.ini.3+(kcjd-(jdplant3+$C$24))/(jdplant3+SUM($C$24,$D$24)-(jdplant3+$C$24))*(kc.mid.3-kc.ini.3)),X495)","v":{"$error":"#N/A"}},{"$f":"MAX(IF(OR(kcjd<jdplant3+SUM($C$24,$D$24),kcjd>jdplant3+SUM($C$24,$D$24,$E$24)),0,kc.mid.3),Y495)","v":{"$error":"#N/A"}},{"$f":"MAX(IF(OR(kcjd<jdplant3+SUM($C$24:$E$24),kcjd>jdplant3+$G$24),0,+kc.mid.3-(kcjd-(jdplant3+SUM($C$24:$E$24)))/((jdplant3+$G$24)-(jdplant3+SUM($C$24:$E$24)))*(kc.mid.3-kc.late.3)),Z495)","v":{"$error":"#N/A"}},{"$error":"#N/A"}]
[null,null,null,null,null,null,null,null,null,null,null,130,0,0.51249999999999996,0,0,{"$f":"MAX(M131:P131)","v":0.51249999999999996},{"$error":"#N/A"},{"$error":"#N/A"},{"$error":"#N/A"},{"$error":"#N/A"},{"$f":"MAX(R131:U131)","v":{"$error":"#N/A"}},{"$error":"#N/A"},{"$error":"#N/A"},{"$error":"#N/A"},{"$error":"#N/A"},{"$f":"MAX(W131:Z131)","v":{"$error":"#N/A"}}]
[null,null,null,null,null,null,null,null,null,null,null,131,0,0.55499999999999994,0,0,0.55499999999999994,{"$error":"#N/A"},{"$error":"#N/A"},{"$error":"#N/A"},{"$error":"#N/A"},{"$error":"#N/A"},{"$error":"#N/A"},{"$error":"#N/A"},{"$error":"#N/A"},{"$error":"#N/A"},{"$error":"#N/A"}]
[null,null,null,null,null,null,null,null,null,null,null,132,0,0.59749999999999992,0,0,0.59749999999999992,{"$error":"#N/A"},{"$error":"#N/A"},{"$error":"#N/A"},{"$error":"#N/A"},{"$error":"#N/A"},{"$error":"#N/A"},{"$error":"#N/A"},{"$error":"#N/A"},{"$error":"#N/A"},{"$error":"#N/A"}]
[null,null,null,null,null,null,null,null,null,null,null,133,0,0.6399999999999999,0,0,0.6399999999999999,{"$error":"#N/A"},{"$error":"#N/A"},{"$error":"#N/A"},{"$error":"#N/A"},{"$error":"#N/A"},{"$error":"#N/A"},{"$error":"#N/A"},{"$error":"#N/A"},{"$error":"#N/A"},{"$error":"#N/A"}]
[null,null,null,null,null,null,null,null,null,null,null,134,0,0.68249999999999988,0,0,0.68249999999999988,{"$error":"#N/A"},{"$error":"#N/A"},{"$error":"#N/A"},{"$error":"#N/A"},{"$error":"#N/A"},{"$error":"#N/A"},{"$error":"#N/A"},{"$error":"#N/A"},{"$error":"#N/A"},{"$error":"#N/A"}]
[null,null,null,null,null,null,null,null,null,null,null,135,0,0.72499999999999987,0,0,0.72499999999999987,{"$error":"#N/A"},{"$error":"#N/A"},{"$error":"#N/A"},{"$error":"#N/A"},{"$error":"#N/A"},{"$error":"#N/A"},{"$error":"#N/A"},{"$error":"#N/A"},{"$error":"#N/A"},{"$error":"#N/A"}]
[null,null,null,null,null,null,null,null,null,null,null,136,0,0.76749999999999996,0,0,0.76749999999999996,{"$error":"#N/A"},{"$error":"#N/A"},{"$error":"#N/A"},{"$error":"#N/A"},{"$error":"#N/A"},{"$error":"#N/A"},{"$error":"#N/A"},{"$error":"#N/A"},{"$error":"#N/A"},{"$error":"#N/A"}]
[null,null,null,null,null,null,null,null,null,null,null,137,0,0.80999999999999983,0,0,0.80999999999999983,{"$error":"#N/A"},{"$error":"#N/A"},{"$error":"#N/A"},{"$error":"#N/A"},{"$error":"#N/A"},{"$error":"#N/A"},{"$error":"#N/A"},{"$error":"#N/A"},{"$error":"#N/A"},{"$error":"#N/A"}]
[null,null,null,null,null,null,null,null,null,null,null,138,0,0.85249999999999981,0,0,0.85249999999999981,{"$error":"#N/A"},{"$error":"#N/A"},{"$error":"#N/A"},{"$error":"#N/A"},{"$error":"#N/A"},{"$error":"#N/A"},{"$error":"#N/A"},{"$error":"#N/A"},{"$error":"#N/A"},{"$error":"#N/A"}]
[null,null,null,null,null,null,null,null,null,null,null,139,0,0.8949999999999998,0,0,0.8949999999999998,{"$error":"#N/A"},{"$error":"#N/A"},{"$error":"#N/A"},{"$error":"#N/A"},{"$error":"#N/A"},{"$error":"#N/A"},{"$error":"#N/A"},{"$error":"#N/A"},{"$error":"#N/A"},{"$error":"#N/A"}]
[null,null,null,null,null,null,null,null,null,null,null,140,0,0.9375,0,0,0.9375,{"$error":"#N/A"},{"$error":"#N/A"},{"$error":"#N/A"},{"$error":"#N/A"},{"$error":"#N/A"},{"$error":"#N/A"},{"$error":"#N/A"},{"$error":"#N/A"},{"$error":"#N/A"},{"$error":"#N/A"}]
[null,null,null,null,null,null,null,null,null,null,null,141,0,0.98,0,0,0.98,{"$error":"#N/A"},{"$error":"#N/A"},{"$error":"#N/A"},{"$error":"#N/A"},{"$error":"#N/A"},{"$error":"#N/A"},{"$error":"#N/A"},{"$error":"#N/A"},{"$error":"#N/A"},{"$error":"#N/A"}]
[null,null,null,null,null,null,null,null,null,null,null,142,0,1.0225,0,0,1.0225,{"$error":"#N/A"},{"$error":"#N/A"},{"$error":"#N/A"},{"$error":"#N/A"},{"$error":"#N/A"},{"$error":"#N/A"},{"$error":"#N/A"},{"$error":"#N/A"},{"$error":"#N/A"},{"$error":"#N/A"}]
[null,null,null,null,null,null,null,null,null,null,null,143,0,1.0649999999999999,0,0,1.0649999999999999,{"$error":"#N/A"},{"$error":"#N/A"},{"$error":"#N/A"},{"$error":"#N/A"},{"$error":"#N/A"},{"$error":"#N/A"},{"$error":"#N/A"},{"$error":"#N/A"},{"$error":"#N/A"},{"$error":"#N/A"}]
[null,null,null,null,null,null,null,null,null,null,null,144,0,1.1074999999999999,0,0,1.1074999999999999,{"$error":"#N/A"},{"$error":"#N/A"},{"$error":"#N/A"},{"$error":"#N/A"},{"$error":"#N/A"},{"$error":"#N/A"},{"$error":"#N/A"},{"$error":"#N/A"},{"$error":"#N/A"},{"$error":"#N/A"}]
[null,null,null,null,null,null,null,null,null,null,null,145,0,1.1499999999999999,1.1499999999999999,0,1.1499999999999999,{"$error":"#N/A"},{"$error":"#N/A"},{"$error":"#N/A"},{"$error":"#N/A"},{"$error":"#N/A"},{"$error":"#N/A"},{"$error":"#N/A"},{"$error":"#N/A"},{"$error":"#N/A"},{"$error":"#N/A"}]
[null,null,null,null,null,null,null,null,null,null,null,146,0,0,1.1499999999999999,0,1.1499999999999999,{"$error":"#N/A"},{"$error":"#N/A"},{"$error":"#N/A"},{"$error":"#N/A"},{"$error":"#N/A"},{"$error":"#N/A"},{"$error":"#N/A"},{"$error":"#N/A"},{"$error":"#N/A"},{"$error":"#N/A"}]
[null,null,null,null,null,null,null,null,null,null,null,147,0,0,1.1499999999999999,0,1.1499999999999999,{"$error":"#N/A"},{"$error":"#N/A"},{"$error":"#N/A"},{"$error":"#N/A"},{"$error":"#N/A"},{"$error":"#N/A"},{"$error":"#N/A"},{"$error":"#N/A"},{"$error":"#N/A"},{"$error":"#N/A"}]
[null,null,null,null,null,null,null,null,null,null,null,148,0,0,1.1499999999999999,0,1.1499999999999999,{"$error":"#N/A"},{"$error":"#N/A"},{"$error":"#N/A"},{"$error":"#N/A"},{"$error":"#N/A"},{"$error":"#N/A"},{"$error":"#N/A"},{"$error":"#N/A"},{"$error":"#N/A"},{"$error":"#N/A"}]
[null,null,null,null,null,null,null,null,null,null,null,149,0,0,1.1499999999999999,0,1.1499999999999999,{"$error":"#N/A"},{"$error":"#N/A"},{"$error":"#N/A"},{"$error":"#N/A"},{"$error":"#N/A"},{"$error":"#N/A"},{"$error":"#N/A"},{"$error":"#N/A"},{"$error":"#N/A"},{"$error":"#N/A"}]
[null,null,null,null,null,null,null,null,null,null,null,150,0,0,1.1499999999999999,0,1.1499999999999999,{"$error":"#N/A"},{"$error":"#N/A"},{"$error":"#N/A"},{"$error":"#N/A"},{"$error":"#N/A"},{"$error":"#N/A"},{"$error":"#N/A"},{"$error":"#N/A"},{"$error":"#N/A"},{"$error":"#N/A"}]
[null,null,null,null,null,null,null,null,null,null,null,151,0,0,1.1499999999999999,0,1.1499999999999999,{"$error":"#N/A"},{"$error":"#N/A"},{"$error":"#N/A"},{"$error":"#N/A"},{"$error":"#N/A"},{"$error":"#N/A"},{"$error":"#N/A"},{"$error":"#N/A"},{"$error":"#N/A"},{"$error":"#N/A"}]
[null,null,null,null,null,null,null,null,null,null,null,152,0,0,1.1499999999999999,0,1.1499999999999999,{"$error":"#N/A"},{"$error":"#N/A"},{"$error":"#N/A"},{"$error":"#N/A"},{"$error":"#N/A"},{"$error":"#N/A"},{"$error":"#N/A"},{"$error":"#N/A"},{"$error":"#N/A"},{"$error":"#N/A"}]
[null,null,null,null,null,null,null,null,null,null,null,153,0,0,1.1499999999999999,0,1.1499999999999999,{"$error":"#N/A"},{"$error":"#N/A"},{"$error":"#N/A"},{"$error":"#N/A"},{"$error":"#N/A"},{"$error":"#N/A"},{"$error":"#N/A"},{"$error":"#N/A"},{"$error":"#N/A"},{"$error":"#N/A"}]
[null,null,null,null,null,null,null,null,null,null,null,154,0,0,1.1499999999999999,0,1.1499999999999999,{"$error":"#N/A"},{"$error":"#N/A"},{"$error":"#N/A"},{"$error":"#N/A"},{"$error":"#N/A"},{"$error":"#N/A"},{"$error":"#N/A"},{"$error":"#N/A"},{"$error":"#N/A"},{"$error":"#N/A"}]
[null,null,null,null,null,null,null,null,null,null,null,155,0,0,1.1499999999999999,0,1.1499999999999999,{"$error":"#N/A"},{"$error":"#N/A"},{"$error":"#N/A"},{"$error":"#N/A"},{"$error":"#N/A"},{"$error":"#N/A"},{"$error":"#N/A"},{"$error":"#N/A"},{"$error":"#N/A"},{"$error":"#N/A"}]
[null,null,null,null,null,null,null,null,null,null,null,156,0,0,1.1499999999999999,0,1.1499999999999999,{"$error":"#N/A"},{"$error":"#N/A"},{"$error":"#N/A"},{"$error":"#N/A"},{"$error":"#N/A"},{"$error":"#N/A"},{"$error":"#N/A"},{"$error":"#N/A"},{"$error":"#N/A"},{"$error":"#N/A"}]
[null,null,null,null,null,null,null,null,null,null,null,157,0,0,1.1499999999999999,0,1.1499999999999999,{"$error":"#N/A"},{"$error":"#N/A"},{"$error":"#N/A"},{"$error":"#N/A"},{"$error":"#N/A"},{"$error":"#N/A"},{"$error":"#N/A"},{"$error":"#N/A"},{"$error":"#N/A"},{"$error":"#N/A"}]
[null,null,null,null,null,null,null,null,null,null,null,158,0,0,1.1499999999999999,0,1.1499999999999999,{"$error":"#N/A"},{"$error":"#N/A"},{"$error":"#N/A"},{"$error":"#N/A"},{"$error":"#N/A"},{"$error":"#N/A"},{"$error":"#N/A"},{"$error":"#N/A"},{"$error":"#N/A"},{"$error":"#N/A"}]
[null,null,null,null,null,null,null,null,null,null,null,159,0,0,1.1499999999999999,0,1.1499999999999999,{"$error":"#N/A"},{"$error":"#N/A"},{"$error":"#N/A"},{"$error":"#N/A"},{"$error":"#N/A"},{"$error":"#N/A"},{"$error":"#N/A"},{"$error":"#N/A"},{"$error":"#N/A"},{"$error":"#N/A"}]
[null,null,null,null,null,null,null,null,null,null,null,160,0,0,1.1499999999999999,0,1.1499999999999999,{"$error":"#N/A"},{"$error":"#N/A"},{"$error":"#N/A"},{"$error":"#N/A"},{"$error":"#N/A"},{"$error":"#N/A"},{"$error":"#N/A"},{"$error":"#N/A"},{"$error":"#N/A"},{"$error":"#N/A"}]
[null,null,null,null,null,null,null,null,null,null,null,161,0,0,1.1499999999999999,0,1.1499999999999999,{"$error":"#N/A"},{"$error":"#N/A"},{"$error":"#N/A"},{"$error":"#N/A"},{"$error":"#N/A"},{"$error":"#N/A"},{"$error":"#N/A"},{"$error":"#N/A"},{"$error":"#N/A"},{"$error":"#N/A"}]
[null,null,null,null,null,null,null,null,null,null,null,162,0,0,1.1499999999999999,0,1.1499999999999999,{"$error":"#N/A"},{"$error":"#N/A"},{"$error":"#N/A"},{"$error":"#N/A"},{"$error":"#N/A"},{"$error":"#N/A"},{"$error":"#N/A"},{"$error":"#N/A"},{"$error":"#N/A"},{"$error":"#N/A"}]
[null,null,null,null,null,null,null,null,null,null,null,163,0,0,1.1499999999999999,0,1.1499999999999999,{"$error":"#N/A"},{"$error":"#N/A"},{"$error":"#N/A"},{"$error":"#N/A"},{"$error":"#N/A"},{"$error":"#N/A"},{"$error":"#N/A"},{"$error":"#N/A"},{"$error":"#N/A"},{"$error":"#N/A"}]
[null,null,null,null,null,null,null,null,null,null,null,164,0,0,1.1499999999999999,0,1.1499999999999999,{"$error":"#N/A"},{"$error":"#N/A"},{"$error":"#N/A"},{"$error":"#N/A"},{"$error":"#N/A"},{"$error":"#N/A"},{"$error":"#N/A"},{"$error":"#N/A"},{"$error":"#N/A"},{"$error":"#N/A"}]
[null,null,null,null,null,null,null,null,null,null,null,165,0,0,1.1499999999999999,0,1.1499999999999999,{"$error":"#N/A"},{"$error":"#N/A"},{"$error":"#N/A"},{"$error":"#N/A"},{"$error":"#N/A"},{"$error":"#N/A"},{"$error":"#N/A"},{"$error":"#N/A"},{"$error":"#N/A"},{"$error":"#N/A"}]
[null,null,null,null,null,null,null,null,null,null,null,166,0,0,1.1499999999999999,0,1.1499999999999999,{"$error":"#N/A"},{"$error":"#N/A"},{"$error":"#N/A"},{"$error":"#N/A"},{"$error":"#N/A"},{"$error":"#N/A"},{"$error":"#N/A"},{"$error":"#N/A"},{"$error":"#N/A"},{"$error":"#N/A"}]
[null,null,null,null,null,null,null,null,null,null,null,167,0,0,1.1499999999999999,0,1.1499999999999999,{"$error":"#N/A"},{"$error":"#N/A"},{"$error":"#N/A"},{"$error":"#N/A"},{"$error":"#N/A"},{"$error":"#N/A"},{"$error":"#N/A"},{"$error":"#N/A"},{"$error":"#N/A"},{"$error":"#N/A"}]
[null,null,null,null,null,null,null,null,null,null,null,168,0,0,1.1499999999999999,0,1.1499999999999999,{"$error":"#N/A"},{"$error":"#N/A"},{"$error":"#N/A"},{"$error":"#N/A"},{"$error":"#N/A"},{"$error":"#N/A"},{"$error":"#N/A"},{"$error":"#N/A"},{"$error":"#N/A"},{"$error":"#N/A"}]
[null,null,null,null,null,null,null,null,null,null,null,169,0,0,1.1499999999999999,0,1.1499999999999999,{"$error":"#N/A"},{"$error":"#N/A"},{"$error":"#N/A"},{"$error":"#N/A"},{"$error":"#N/A"},{"$error":"#N/A"},{"$error":"#N/A"},{"$error":"#N/A"},{"$error":"#N/A"},{"$error":"#N/A"}]
[null,null,null,null,null,null,null,null,null,null,null,170,0,0,1.1499999999999999,0,1.1499999999999999,{"$error":"#N/A"},{"$error":"#N/A"},{"$error":"#N/A"},{"$error":"#N/A"},{"$error":"#N/A"},{"$error":"#N/A"},{"$error":"#N/A"},{"$error":"#N/A"},{"$error":"#N/A"},{"$error":"#N/A"}]
[null,null,null,null,null,null,null,null,null,null,null,171,0,0,1.1499999999999999,0,1.1499999999999999,{"$error":"#N/A"},{"$error":"#N/A"},{"$error":"#N/A"},{"$error":"#N/A"},{"$error":"#N/A"},{"$error":"#N/A"},{"$error":"#N/A"},{"$error":"#N/A"},{"$error":"#N/A"},{"$error":"#N/A"}]
[null,null,null,null,null,null,null,null,null,null,null,172,0,0,1.1499999999999999,0,1.1499999999999999,{"$error":"#N/A"},{"$error":"#N/A"},{"$error":"#N/A"},{"$error":"#N/A"},{"$error":"#N/A"},{"$error":"#N/A"},{"$error":"#N/A"},{"$error":"#N/A"},{"$error":"#N/A"},{"$error":"#N/A"}]
[null,null,null,null,null,null,null,null,null,null,null,173,0,0,1.1499999999999999,0,1.1499999999999999,{"$error":"#N/A"},{"$error":"#N/A"},{"$error":"#N/A"},{"$error":"#N/A"},{"$error":"#N/A"},{"$error":"#N/A"},{"$error":"#N/A"},{"$error":"#N/A"},{"$error":"#N/A"},{"$error":"#N/A"}]
[null,null,null,null,null,null,null,null,null,null,null,174,0,0,1.1499999999999999,0,1.1499999999999999,{"$error":"#N/A"},{"$error":"#N/A"},{"$error":"#N/A"},{"$error":"#N/A"},{"$error":"#N/A"},{"$error":"#N/A"},{"$error":"#N/A"},{"$error":"#N/A"},{"$error":"#N/A"},{"$error":"#N/A"}]
[null,null,null,null,null,null,null,null,null,null,null,175,0,0,1.1499999999999999,1.1499999999999999,1.1499999999999999,{"$error":"#N/A"},{"$error":"#N/A"},{"$error":"#N/A"},{"$error":"#N/A"},{"$error":"#N/A"},{"$error":"#N/A"},{"$error":"#N/A"},{"$error":"#N/A"},{"$error":"#N/A"},{"$error":"#N/A"}]
[null,null,null,null,null,null,null,null,null,null,null,176,0,0,0,1.1399999999999999,1.1399999999999999,{"$error":"#N/A"},{"$error":"#N/A"},{"$error":"#N/A"},{"$error":"#N/A"},{"$error":"#N/A"},{"$error":"#N/A"},{"$error":"#N/A"},{"$error":"#N/A"},{"$error":"#N/A"},{"$error":"#N/A"}]
[null,null,null,null,null,null,null,null,null,null,null,177,0,0,0,1.1299999999999999,1.1299999999999999,{"$error":"#N/A"},{"$error":"#N/A"},{"$error":"#N/A"},{"$error":"#N/A"},{"$error":"#N/A"},{"$error":"#N/A"},{"$error":"#N/A"},{"$error":"#N/A"},{"$error":"#N/A"},{"$error":"#N/A"}]
[null,null,null,null,null,null,null,null,null,null,null,178,0,0,0,1.1199999999999999,1.1199999999999999,{"$error":"#N/A"},{"$error":"#N/A"},{"$error":"#N/A"},{"$error":"#N/A"},{"$error":"#N/A"},{"$error":"#N/A"},{"$error":"#N/A"},{"$error":"#N/A"},{"$error":"#N/A"},{"$error":"#N/A"}]
[null,null,null,null,null,null,null,null,null,null,null,179,0,0,0,1.1099999999999999,1.1099999999999999,{"$error":"#N/A"},{"$error":"#N/A"},{"$error":"#N/A"},{"$error":"#N/A"},{"$error":"#N/A"},{"$error":"#N/A"},{"$error":"#N/A"},{"$error":"#N/A"},{"$error":"#N/A"},{"$error":"#N/A"}]
[null,null,null,null,null,null,null,null,null,null,null,180,0,0,0,1.1000000000000001,1.1000000000000001,{"$error":"#N/A"},{"$error":"#N/A"},{"$error":"#N/A"},{"$error":"#N/A"},{"$error":"#N/A"},{"$error":"#N/A"},{"$error":"#N/A"},{"$error":"#N/A"},{"$error":"#N/A"},{"$error":"#N/A"}]
[null,null,null,null,null,null,null,null,null,null,null,181,0,0,0,1.0900000000000001,1.0900000000000001,{"$error":"#N/A"},{"$error":"#N/A"},{"$error":"#N/A"},{"$error":"#N/A"},{"$error":"#N/A"},{"$error":"#N/A"},{"$error":"#N/A"},{"$error":"#N/A"},{"$error":"#N/A"},{"$error":"#N/A"}]
[null,null,null,null,null,null,null,null,null,null,null,182,0,0,0,1.08,1.08,{"$error":"#N/A"},{"$error":"#N/A"},{"$error":"#N/A"},{"$error":"#N/A"},{"$error":"#N/A"},{"$error":"#N/A"},{"$error":"#N/A"},{"$error":"#N/A"},{"$error":"#N/A"},{"$error":"#N/A"}]
[null,null,null,null,null,null,null,null,null,null,null,183,0,0,0,1.07,1.07,{"$error":"#N/A"},{"$error":"#N/A"},{"$error":"#N/A"},{"$error":"#N/A"},{"$error":"#N/A"},{"$error":"#N/A"},{"$error":"#N/A"},{"$error":"#N/A"},{"$error":"#N/A"},{"$error":"#N/A"}]
[null,null,null,null,null,null,null,null,null,null,null,184,0,0,0,1.06,1.06,{"$error":"#N/A"},{"$error":"#N/A"},{"$error":"#N/A"},{"$error":"#N/A"},{"$error":"#N/A"},{"$error":"#N/A"},{"$error":"#N/A"},{"$error":"#N/A"},{"$error":"#N/A"},{"$error":"#N/A"}]
[null,null,null,null,null,null,null,null,null,null,null,185,0,0,0,1.05,1.05,{"$error":"#N/A"},{"$error":"#N/A"},{"$error":"#N/A"},{"$error":"#N/A"},{"$error":"#N/A"},{"$error":"#N/A"},{"$error":"#N/A"},{"$error":"#N/A"},{"$error":"#N/A"},{"$error":"#N/A"}]
[null,null,null,null,null,null,null,null,null,null,null,186,0,0,0,0,0,{"$error":"#N/A"},{"$error":"#N/A"},{"$error":"#N/A"},{"$error":"#N/A"},{"$error":"#N/A"},{"$error":"#N/A"},{"$error":"#N/A"},{"$error":"#N/A"},{"$error":"#N/A"},{"$error":"#N/A"}]
[null,null,null,null,null,null,null,null,null,null,null,187,0,0,0,0,0,{"$error":"#N/A"},{"$error":"#N/A"},{"$error":"#N/A"},{"$error":"#N/A"},{"$error":"#N/A"},{"$error":"#N/A"},{"$error":"#N/A"},{"$error":"#N/A"},{"$error":"#N/A"},{"$error":"#N/A"}]
[null,null,null,null,null,null,null,null,null,null,null,188,0,0,0,0,0,{"$error":"#N/A"},{"$error":"#N/A"},{"$error":"#N/A"},{"$error":"#N/A"},{"$error":"#N/A"},{"$error":"#N/A"},{"$error":"#N/A"},{"$error":"#N/A"},{"$error":"#N/A"},{"$error":"#N/A"}]
[null,null,null,null,null,null,null,null,null,null,null,189,0,0,0,0,0,{"$error":"#N/A"},{"$error":"#N/A"},{"$error":"#N/A"},{"$error":"#N/A"},{"$error":"#N/A"},{"$error":"#N/A"},{"$error":"#N/A"},{"$error":"#N/A"},{"$error":"#N/A"},{"$error":"#N/A"}]
[null,null,null,null,null,null,null,null,null,null,null,190,0,0,0,0,0,{"$error":"#N/A"},{"$error":"#N/A"},{"$error":"#N/A"},{"$error":"#N/A"},{"$error":"#N/A"},{"$error":"#N/A"},{"$error":"#N/A"},{"$error":"#N/A"},{"$error":"#N/A"},{"$error":"#N/A"}]
[null,null,null,null,null,null,null,null,null,null,null,191,0,0,0,0,0,{"$error":"#N/A"},{"$error":"#N/A"},{"$error":"#N/A"},{"$error":"#N/A"},{"$error":"#N/A"},{"$error":"#N/A"},{"$error":"#N/A"},{"$error":"#N/A"},{"$error":"#N/A"},{"$error":"#N/A"}]
[null,null,null,null,null,null,null,null,null,null,null,192,0,0,0,0,0,{"$error":"#N/A"},{"$error":"#N/A"},{"$error":"#N/A"},{"$error":"#N/A"},{"$error":"#N/A"},{"$error":"#N/A"},{"$error":"#N/A"},{"$error":"#N/A"},{"$error":"#N/A"},{"$error":"#N/A"}]
[null,null,null,null,null,null,null,null,null,null,null,193,{"$f":"MAX(IF(OR(kcjd<jdplant1,kcjd>jdplant1+C$22),0,kc.ini.1),M559)","v":0},{"$f":"MAX(IF(OR(kcjd<jdplant1+C$22,kcjd>jdplant1+SUM(C$22,D$22)),0,+H$22+(kcjd-(jdplant1+C$22))/(jdplant1+SUM(C$22,D$22)-(jdplant1+C$22))*(I$22-H$22)),N559)","v":0},{"$f":"MAX(IF(OR(kcjd<jdplant1+SUM(C$22,D$22),kcjd>jdplant1+SUM(C$22,D$22,E$22)),0,kc.mid.1),O559)","v":0},{"$f":"MAX(IF(OR(kcjd<jdplant1+SUM(C$22:E$22),kcjd>jdplant1+G$22),0,+I$22-(kcjd-(jdplant1+SUM(C$22:E$22)))/((jdplant1+G$22)-(jdplant1+SUM(C$22:E$22)))*(I$22-J$22)),P559)","v":0},0,{"$f":"MAX(IF(OR(kcjd<jdplant2,kcjd>jdplant2+$C$23),0,kc.ini.2),R559)","v":{"$error":"#N/A"}},{"$f":"MAX(IF(OR(kcjd<jdplant2+$C$23,kcjd>jdplant2+SUM($C$23,$D$23)),0,+kc.ini.2+(kcjd-(jdplant2+$C$23))/(jdplant2+SUM($C$23,$D$23)-(jdplant2+$C$23))*(kc.mid.2-kc.ini.2)),S559)","v":{"$error":"#N/A"}},{"$f":"MAX(IF(OR(kcjd<jdplant2+SUM($C$23,$D$23),kcjd>jdplant2+SUM($C$23,$D$23,$E$23)),0,kc.mid.2),T559)","v":{"$error":"#N/A"}},{"$f":"MAX(IF(OR(kcjd<jdplant2+SUM($C$23:$E$23),kcjd>jdplant2+$G$23),0,+kc.mid.2-(kcjd-(jdplant2+SUM($C$23:$E$23)))/((jdplant2+$G$23)-(jdplant2+SUM($C$23:$E$23)))*(kc.mid.2-kc.late.2)),U559)","v":{"$error":"#N/A"}},{"$error":"#N/A"},{"$f":"MAX(IF(OR(kcjd<jdplant3,kcjd>jdplant3+$C$24),0,kc.ini.3),W559)","v":{"$error":"#N/A"}},{"$f":"MAX(IF(OR(kcjd<jdplant3+$C$24,kcjd>jdplant3+SUM($C$24,$D$24)),0,+kc.ini.3+(kcjd-(jdplant3+$C$24))/(jdplant3+SUM($C$24,$D$24)-(jdplant3+$C$24))*(kc.mid.3-kc.ini.3)),X559)","v":{"$error":"#N/A"}},{"$f":"MAX(IF(OR(kcjd<jdplant3+SUM($C$24,$D$24),kcjd>jdplant3+SUM($C$24,$D$24,$E$24)),0,kc.mid.3),Y559)","v":{"$error":"#N/A"}},{"$f":"MAX(IF(OR(kcjd<jdplant3+SUM($C$24:$E$24),kcjd>jdplant3+$G$24),0,+kc.mid.3-(kcjd-(jdplant3+SUM($C$24:$E$24)))/((jdplant3+$G$24)-(jdplant3+SUM($C$24:$E$24)))*(kc.mid.3-kc.late.3)),Z559)","v":{"$error":"#N/A"}},{"$error":"#N/A"}]
[null,null,null,null,null,null,null,null,null,null,null,194,0,0,0,0,{"$f":"MAX(M195:P195)","v":0},{"$error":"#N/A"},{"$error":"#N/A"},{"$error":"#N/A"},{"$error":"#N/A"},{"$f":"MAX(R195:U195)","v":{"$error":"#N/A"}},{"$error":"#N/A"},{"$error":"#N/A"},{"$error":"#N/A"},{"$error":"#N/A"},{"$f":"MAX(W195:Z195)","v":{"$error":"#N/A"}}]
[null,null,null,null,null,null,null,null,null,null,null,195,0,0,0,0,0,{"$error":"#N/A"},{"$error":"#N/A"},{"$error":"#N/A"},{"$error":"#N/A"},{"$error":"#N/A"},{"$error":"#N/A"},{"$error":"#N/A"},{"$error":"#N/A"},{"$error":"#N/A"},{"$error":"#N/A"}]
[null,null,null,null,null,null,null,null,null,null,null,196,0,0,0,0,0,{"$error":"#N/A"},{"$error":"#N/A"},{"$error":"#N/A"},{"$error":"#N/A"},{"$error":"#N/A"},{"$error":"#N/A"},{"$error":"#N/A"},{"$error":"#N/A"},{"$error":"#N/A"},{"$error":"#N/A"}]
[null,null,null,null,null,null,null,null,null,null,null,197,0,0,0,0,0,{"$error":"#N/A"},{"$error":"#N/A"},{"$error":"#N/A"},{"$error":"#N/A"},{"$error":"#N/A"},{"$error":"#N/A"},{"$error":"#N/A"},{"$error":"#N/A"},{"$error":"#N/A"},{"$error":"#N/A"}]
[null,null,null,null,null,null,null,null,null,null,null,198,0,0,0,0,0,{"$error":"#N/A"},{"$error":"#N/A"},{"$error":"#N/A"},{"$error":"#N/A"},{"$error":"#N/A"},{"$error":"#N/A"},{"$error":"#N/A"},{"$error":"#N/A"},{"$error":"#N/A"},{"$error":"#N/A"}]
[null,null,null,null,null,null,null,null,null,null,null,199,0,0,0,0,0,{"$error":"#N/A"},{"$error":"#N/A"},{"$error":"#N/A"},{"$error":"#N/A"},{"$error":"#N/A"},{"$error":"#N/A"},{"$error":"#N/A"},{"$error":"#N/A"},{"$error":"#N/A"},{"$error":"#N/A"}]
[null,null,null,null,null,null,null,null,null,null,null,200,0,0,0,0,0,{"$error":"#N/A"},{"$error":"#N/A"},{"$error":"#N/A"},{"$error":"#N/A"},{"$error":"#N/A"},{"$error":"#N/A"},{"$error":"#N/A"},{"$error":"#N/A"},{"$error":"#N/A"},{"$error":"#N/A"}]
[null,null,null,null,null,null,null,null,null,null,null,201,0,0,0,0,0,{"$error":"#N/A"},{"$error":"#N/A"},{"$error":"#N/A"},{"$error":"#N/A"},{"$error":"#N/A"},{"$error":"#N/A"},{"$error":"#N/A"},{"$error":"#N/A"},{"$error":"#N/A"},{"$error":"#N/A"}]
[null,null,null,null,null,null,null,null,null,null,null,202,0,0,0,0,0,{"$error":"#N/A"},{"$error":"#N/A"},{"$error":"#N/A"},{"$error":"#N/A"},{"$error":"#N/A"},{"$error":"#N/A"},{"$error":"#N/A"},{"$error":"#N/A"},{"$error":"#N/A"},{"$error":"#N/A"}]
[null,null,null,null,null,null,null,null,null,null,null,203,0,0,0,0,0,{"$error":"#N/A"},{"$error":"#N/A"},{"$error":"#N/A"},{"$error":"#N/A"},{"$error":"#N/A"},{"$error":"#N/A"},{"$error":"#N/A"},{"$error":"#N/A"},{"$error":"#N/A"},{"$error":"#N/A"}]
[null,null,null,null,null,null,null,null,null,null,null,204,0,0,0,0,0,{"$error":"#N/A"},{"$error":"#N/A"},{"$error":"#N/A"},{"$error":"#N/A"},{"$error":"#N/A"},{"$error":"#N/A"},{"$error":"#N/A"},{"$error":"#N/A"},{"$error":"#N/A"},{"$error":"#N/A"}]
[null,null,null,null,null,null,null,null,null,null,null,205,0,0,0,0,0,{"$error":"#N/A"},{"$error":"#N/A"},{"$error":"#N/A"},{"$error":"#N/A"},{"$error":"#N/A"},{"$error":"#N/A"},{"$error":"#N/A"},{"$error":"#N/A"},{"$error":"#N/A"},{"$error":"#N/A"}]
[null,null,null,null,null,null,null,null,null,null,null,206,0,0,0,0,0,{"$error":"#N/A"},{"$error":"#N/A"},{"$error":"#N/A"},{"$error":"#N/A"},{"$error":"#N/A"},{"$error":"#N/A"},{"$error":"#N/A"},{"$error":"#N/A"},{"$error":"#N/A"},{"$error":"#N/A"}]
[null,null,null,null,null,null,null,null,null,null,null,207,0,0,0,0,0,{"$error":"#N/A"},{"$error":"#N/A"},{"$error":"#N/A"},{"$error":"#N/A"},{"$error":"#N/A"},{"$error":"#N/A"},{"$error":"#N/A"},{"$error":"#N/A"},{"$error":"#N/A"},{"$error":"#N/A"}]
[null,null,null,null,null,null,null,null,null,null,null,208,0,0,0,0,0,{"$error":"#N/A"},{"$error":"#N/A"},{"$error":"#N/A"},{"$error":"#N/A"},{"$error":"#N/A"},{"$error":"#N/A"},{"$error":"#N/A"},{"$error":"#N/A"},{"$error":"#N/A"},{"$error":"#N/A"}]
[null,null,null,null,null,null,null,null,null,null,null,209,0,0,0,0,0,{"$error":"#N/A"},{"$error":"#N/A"},{"$error":"#N/A"},{"$error":"#N/A"},{"$error":"#N/A"},{"$error":"#N/A"},{"$error":"#N/A"},{"$error":"#N/A"},{"$error":"#N/A"},{"$error":"#N/A"}]
[null,null,null,null,null,null,null,null,null,null,null,210,0,0,0,0,0,{"$error":"#N/A"},{"$error":"#N/A"},{"$error":"#N/A"},{"$error":"#N/A"},{"$error":"#N/A"},{"$error":"#N/A"},{"$error":"#N/A"},{"$error":"#N/A"},{"$error":"#N/A"},{"$error":"#N/A"}]
[null,null,null,null,null,null,null,null,null,null,null,211,0,0,0,0,0,{"$error":"#N/A"},{"$error":"#N/A"},{"$error":"#N/A"},{"$error":"#N/A"},{"$error":"#N/A"},{"$error":"#N/A"},{"$error":"#N/A"},{"$error":"#N/A"},{"$error":"#N/A"},{"$error":"#N/A"}]
[null,null,null,null,null,null,null,null,null,null,null,212,0,0,0,0,0,{"$error":"#N/A"},{"$error":"#N/A"},{"$error":"#N/A"},{"$error":"#N/A"},{"$error":"#N/A"},{"$error":"#N/A"},{"$error":"#N/A"},{"$error":"#N/A"},{"$error":"#N/A"},{"$error":"#N/A"}]
[null,null,null,null,null,null,null,null,null,null,null,213,0,0,0,0,0,{"$error":"#N/A"},{"$error":"#N/A"},{"$error":"#N/A"},{"$error":"#N/A"},{"$error":"#N/A"},{"$error":"#N/A"},{"$error":"#N/A"},{"$error":"#N/A"},{"$error":"#N/A"},{"$error":"#N/A"}]
[null,null,null,null,null,null,null,null,null,null,null,214,0,0,0,0,0,{"$error":"#N/A"},{"$error":"#N/A"},{"$error":"#N/A"},{"$error":"#N/A"},{"$error":"#N/A"},{"$error":"#N/A"},{"$error":"#N/A"},{"$error":"#N/A"},{"$error":"#N/A"},{"$error":"#N/A"}]
[null,null,null,null,null,null,null,null,null,null,null,215,0,0,0,0,0,{"$error":"#N/A"},{"$error":"#N/A"},{"$error":"#N/A"},{"$error":"#N/A"},{"$error":"#N/A"},{"$error":"#N/A"},{"$error":"#N/A"},{"$error":"#N/A"},{"$error":"#N/A"},{"$error":"#N/A"}]
[null,null,null,null,null,null,null,null,null,null,null,216,0,0,0,0,0,{"$error":"#N/A"},{"$error":"#N/A"},{"$error":"#N/A"},{"$error":"#N/A"},{"$error":"#N/A"},{"$error":"#N/A"},{"$error":"#N/A"},{"$error":"#N/A"},{"$error":"#N/A"},{"$error":"#N/A"}]
[null,null,null,null,null,null,null,null,null,null,null,217,0,0,0,0,0,{"$error":"#N/A"},{"$error":"#N/A"},{"$error":"#N/A"},{"$error":"#N/A"},{"$error":"#N/A"},{"$error":"#N/A"},{"$error":"#N/A"},{"$error":"#N/A"},{"$error":"#N/A"},{"$error":"#N/A"}]
[null,null,null,null,null,null,null,null,null,null,null,218,0,0,0,0,0,{"$error":"#N/A"},{"$error":"#N/A"},{"$error":"#N/A"},{"$error":"#N/A"},{"$error":"#N/A"},{"$error":"#N/A"},{"$error":"#N/A"},{"$error":"#N/A"},{"$error":"#N/A"},{"$error":"#N/A"}]
[null,null,null,null,null,null,null,null,null,null,null,219,0,0,0,0,0,{"$error":"#N/A"},{"$error":"#N/A"},{"$error":"#N/A"},{"$error":"#N/A"},{"$error":"#N/A"},{"$error":"#N/A"},{"$error":"#N/A"},{"$error":"#N/A"},{"$error":"#N/A"},{"$error":"#N/A"}]
[null,null,null,null,null,null,null,null,null,null,null,220,0,0,0,0,0,{"$error":"#N/A"},{"$error":"#N/A"},{"$error":"#N/A"},{"$error":"#N/A"},{"$error":"#N/A"},{"$error":"#N/A"},{"$error":"#N/A"},{"$error":"#N/A"},{"$error":"#N/A"},{"$error":"#N/A"}]
[null,null,null,null,null,null,null,null,null,null,null,221,0,0,0,0,0,{"$error":"#N/A"},{"$error":"#N/A"},{"$error":"#N/A"},{"$error":"#N/A"},{"$error":"#N/A"},{"$error":"#N/A"},{"$error":"#N/A"},{"$error":"#N/A"},{"$error":"#N/A"},{"$error":"#N/A"}]
[null,null,null,null,null,null,null,null,null,null,null,222,0,0,0,0,0,{"$error":"#N/A"},{"$error":"#N/A"},{"$error":"#N/A"},{"$error":"#N/A"},{"$error":"#N/A"},{"$error":"#N/A"},{"$error":"#N/A"},{"$error":"#N/A"},{"$error":"#N/A"},{"$error":"#N/A"}]
[null,null,null,null,null,null,null,null,null,null,null,223,0,0,0,0,0,{"$error":"#N/A"},{"$error":"#N/A"},{"$error":"#N/A"},{"$error":"#N/A"},{"$error":"#N/A"},{"$error":"#N/A"},{"$error":"#N/A"},{"$error":"#N/A"},{"$error":"#N/A"},{"$error":"#N/A"}]
[null,null,null,null,null,null,null,null,null,null,null,224,0,0,0,0,0,{"$error":"#N/A"},{"$error":"#N/A"},{"$error":"#N/A"},{"$error":"#N/A"},{"$error":"#N/A"},{"$error":"#N/A"},{"$error":"#N/A"},{"$error":"#N/A"},{"$error":"#N/A"},{"$error":"#N/A"}]
[null,null,null,null,null,null,null,null,null,null,null,225,0,0,0,0,0,{"$error":"#N/A"},{"$error":"#N/A"},{"$error":"#N/A"},{"$error":"#N/A"},{"$error":"#N/A"},{"$error":"#N/A"},{"$error":"#N/A"},{"$error":"#N/A"},{"$error":"#N/A"},{"$error":"#N/A"}]
[null,null,null,null,null,null,null,null,null,null,null,226,0,0,0,0,0,{"$error":"#N/A"},{"$error":"#N/A"},{"$error":"#N/A"},{"$error":"#N/A"},{"$error":"#N/A"},{"$error":"#N/A"},{"$error":"#N/A"},{"$error":"#N/A"},{"$error":"#N/A"},{"$error":"#N/A"}]
[null,null,null,null,null,null,null,null,null,null,null,227,0,0,0,0,0,{"$error":"#N/A"},{"$error":"#N/A"},{"$error":"#N/A"},{"$error":"#N/A"},{"$error":"#N/A"},{"$error":"#N/A"},{"$error":"#N/A"},{"$error":"#N/A"},{"$error":"#N/A"},{"$error":"#N/A"}]
[null,null,null,null,null,null,null,null,null,null,null,228,0,0,0,0,0,{"$error":"#N/A"},{"$error":"#N/A"},{"$error":"#N/A"},{"$error":"#N/A"},{"$error":"#N/A"},{"$error":"#N/A"},{"$error":"#N/A"},{"$error":"#N/A"},{"$error":"#N/A"},{"$error":"#N/A"}]
[null,null,null,null,null,null,null,null,null,null,null,229,0,0,0,0,0,{"$error":"#N/A"},{"$error":"#N/A"},{"$error":"#N/A"},{"$error":"#N/A"},{"$error":"#N/A"},{"$error":"#N/A"},{"$error":"#N/A"},{"$error":"#N/A"},{"$error":"#N/A"},{"$error":"#N/A"}]
[null,null,null,null,null,null,null,null,null,null,null,230,0,0,0,0,0,{"$error":"#N/A"},{"$error":"#N/A"},{"$error":"#N/A"},{"$error":"#N/A"},{"$error":"#N/A"},{"$error":"#N/A"},{"$error":"#N/A"},{"$error":"#N/A"},{"$error":"#N/A"},{"$error":"#N/A"}]
[null,null,null,null,null,null,null,null,null,null,null,231,0,0,0,0,0,{"$error":"#N/A"},{"$error":"#N/A"},{"$error":"#N/A"},{"$error":"#N/A"},{"$error":"#N/A"},{"$error":"#N/A"},{"$error":"#N/A"},{"$error":"#N/A"},{"$error":"#N/A"},{"$error":"#N/A"}]
[null,null,null,null,null,null,null,null,null,null,null,232,0,0,0,0,0,{"$error":"#N/A"},{"$error":"#N/A"},{"$error":"#N/A"},{"$error":"#N/A"},{"$error":"#N/A"},{"$error":"#N/A"},{"$error":"#N/A"},{"$error":"#N/A"},{"$error":"#N/A"},{"$error":"#N/A"}]
[null,null,null,null,null,null,null,null,null,null,null,233,0,0,0,0,0,{"$error":"#N/A"},{"$error":"#N/A"},{"$error":"#N/A"},{"$error":"#N/A"},{"$error":"#N/A"},{"$error":"#N/A"},{"$error":"#N/A"},{"$error":"#N/A"},{"$error":"#N/A"},{"$error":"#N/A"}]
[null,null,null,null,null,null,null,null,null,null,null,234,0,0,0,0,0,{"$error":"#N/A"},{"$error":"#N/A"},{"$error":"#N/A"},{"$error":"#N/A"},{"$error":"#N/A"},{"$error":"#N/A"},{"$error":"#N/A"},{"$error":"#N/A"},{"$error":"#N/A"},{"$error":"#N/A"}]
[null,null,null,null,null,null,null,null,null,null,null,235,0,0,0,0,0,{"$error":"#N/A"},{"$error":"#N/A"},{"$error":"#N/A"},{"$error":"#N/A"},{"$error":"#N/A"},{"$error":"#N/A"},{"$error":"#N/A"},{"$error":"#N/A"},{"$error":"#N/A"},{"$error":"#N/A"}]
[null,null,null,null,null,null,null,null,null,null,null,236,0,0,0,0,0,{"$error":"#N/A"},{"$error":"#N/A"},{"$error":"#N/A"},{"$error":"#N/A"},{"$error":"#N/A"},{"$error":"#N/A"},{"$error":"#N/A"},{"$error":"#N/A"},{"$error":"#N/A"},{"$error":"#N/A"}]
[null,null,null,null,null,null,null,null,null,null,null,237,0,0,0,0,0,{"$error":"#N/A"},{"$error":"#N/A"},{"$error":"#N/A"},{"$error":"#N/A"},{"$error":"#N/A"},{"$error":"#N/A"},{"$error":"#N/A"},{"$error":"#N/A"},{"$error":"#N/A"},{"$error":"#N/A"}]
[null,null,null,null,null,null,null,null,null,null,null,238,0,0,0,0,0,{"$error":"#N/A"},{"$error":"#N/A"},{"$error":"#N/A"},{"$error":"#N/A"},{"$error":"#N/A"},{"$error":"#N/A"},{"$error":"#N/A"},{"$error":"#N/A"},{"$error":"#N/A"},{"$error":"#N/A"}]
[null,null,null,null,null,null,null,null,null,null,null,239,0,0,0,0,0,{"$error":"#N/A"},{"$error":"#N/A"},{"$error":"#N/A"},{"$error":"#N/A"},{"$error":"#N/A"},{"$error":"#N/A"},{"$error":"#N/A"},{"$error":"#N/A"},{"$error":"#N/A"},{"$error":"#N/A"}]
[null,null,null,null,null,null,null,null,null,null,null,240,0,0,0,0,0,{"$error":"#N/A"},{"$error":"#N/A"},{"$error":"#N/A"},{"$error":"#N/A"},{"$error":"#N/A"},{"$error":"#N/A"},{"$error":"#N/A"},{"$error":"#N/A"},{"$error":"#N/A"},{"$error":"#N/A"}]
[null,null,null,null,null,null,null,null,null,null,null,241,0,0,0,0,0,{"$error":"#N/A"},{"$error":"#N/A"},{"$error":"#N/A"},{"$error":"#N/A"},{"$error":"#N/A"},{"$error":"#N/A"},{"$error":"#N/A"},{"$error":"#N/A"},{"$error":"#N/A"},{"$error":"#N/A"}]
[null,null,null,null,null,null,null,null,null,null,null,242,0,0,0,0,0,{"$error":"#N/A"},{"$error":"#N/A"},{"$error":"#N/A"},{"$error":"#N/A"},{"$error":"#N/A"},{"$error":"#N/A"},{"$error":"#N/A"},{"$error":"#N/A"},{"$error":"#N/A"},{"$error":"#N/A"}]
[null,null,null,null,null,null,null,null,null,null,null,243,0,0,0,0,0,{"$error":"#N/A"},{"$error":"#N/A"},{"$error":"#N/A"},{"$error":"#N/A"},{"$error":"#N/A"},{"$error":"#N/A"},{"$error":"#N/A"},{"$error":"#N/A"},{"$error":"#N/A"},{"$error":"#N/A"}]
[null,null,null,null,null,null,null,null,null,null,null,244,0,0,0,0,0,{"$error":"#N/A"},{"$error":"#N/A"},{"$error":"#N/A"},{"$error":"#N/A"},{"$error":"#N/A"},{"$error":"#N/A"},{"$error":"#N/A"},{"$error":"#N/A"},{"$error":"#N/A"},{"$error":"#N/A"}]
[null,null,null,null,null,null,null,null,null,null,null,245,0,0,0,0,0,{"$error":"#N/A"},{"$error":"#N/A"},{"$error":"#N/A"},{"$error":"#N/A"},{"$error":"#N/A"},{"$error":"#N/A"},{"$error":"#N/A"},{"$error":"#N/A"},{"$error":"#N/A"},{"$error":"#N/A"}]
[null,null,null,null,null,null,null,null,null,null,null,246,0,0,0,0,0,{"$error":"#N/A"},{"$error":"#N/A"},{"$error":"#N/A"},{"$error":"#N/A"},{"$error":"#N/A"},{"$error":"#N/A"},{"$error":"#N/A"},{"$error":"#N/A"},{"$error":"#N/A"},{"$error":"#N/A"}]
[null,null,null,null,null,null,null,null,null,null,null,247,0,0,0,0,0,{"$error":"#N/A"},{"$error":"#N/A"},{"$error":"#N/A"},{"$error":"#N/A"},{"$error":"#N/A"},{"$error":"#N/A"},{"$error":"#N/A"},{"$error":"#N/A"},{"$error":"#N/A"},{"$error":"#N/A"}]
[null,null,null,null,null,null,null,null,null,null,null,248,0,0,0,0,0,{"$error":"#N/A"},{"$error":"#N/A"},{"$error":"#N/A"},{"$error":"#N/A"},{"$error":"#N/A"},{"$error":"#N/A"},{"$error":"#N/A"},{"$error":"#N/A"},{"$error":"#N/A"},{"$error":"#N/A"}]
[null,null,null,null,null,null,null,null,null,null,null,249,0,0,0,0,0,{"$error":"#N/A"},{"$error":"#N/A"},{"$error":"#N/A"},{"$error":"#N/A"},{"$error":"#N/A"},{"$error":"#N/A"},{"$error":"#N/A"},{"$error":"#N/A"},{"$error":"#N/A"},{"$error":"#N/A"}]
[null,null,null,null,null,null,null,null,null,null,null,250,0,0,0,0,0,{"$error":"#N/A"},{"$error":"#N/A"},{"$error":"#N/A"},{"$error":"#N/A"},{"$error":"#N/A"},{"$error":"#N/A"},{"$error":"#N/A"},{"$error":"#N/A"},{"$error":"#N/A"},{"$error":"#N/A"}]
[null,null,null,null,null,null,null,null,null,null,null,251,0,0,0,0,0,{"$error":"#N/A"},{"$error":"#N/A"},{"$error":"#N/A"},{"$error":"#N/A"},{"$error":"#N/A"},{"$error":"#N/A"},{"$error":"#N/A"},{"$error":"#N/A"},{"$error":"#N/A"},{"$error":"#N/A"}]
[null,null,null,null,null,null,null,null,null,null,null,252,0,0,0,0,0,{"$error":"#N/A"},{"$error":"#N/A"},{"$error":"#N/A"},{"$error":"#N/A"},{"$error":"#N/A"},{"$error":"#N/A"},{"$error":"#N/A"},{"$error":"#N/A"},{"$error":"#N/A"},{"$error":"#N/A"}]
[null,null,null,null,null,null,null,null,null,null,null,253,0,0,0,0,0,{"$error":"#N/A"},{"$error":"#N/A"},{"$error":"#N/A"},{"$error":"#N/A"},{"$error":"#N/A"},{"$error":"#N/A"},{"$error":"#N/A"},{"$error":"#N/A"},{"$error":"#N/A"},{"$error":"#N/A"}]
[null,null,null,null,null,null,null,null,null,null,null,254,0,0,0,0,0,{"$error":"#N/A"},{"$error":"#N/A"},{"$error":"#N/A"},{"$error":"#N/A"},{"$error":"#N/A"},{"$error":"#N/A"},{"$error":"#N/A"},{"$error":"#N/A"},{"$error":"#N/A"},{"$error":"#N/A"}]
[null,null,null,null,null,null,null,null,null,null,null,255,0,0,0,0,0,{"$error":"#N/A"},{"$error":"#N/A"},{"$error":"#N/A"},{"$error":"#N/A"},{"$error":"#N/A"},{"$error":"#N/A"},{"$error":"#N/A"},{"$error":"#N/A"},{"$error":"#N/A"},{"$error":"#N/A"}]
[null,null,null,null,null,null,null,null,null,null,null,256,0,0,0,0,0,{"$error":"#N/A"},{"$error":"#N/A"},{"$error":"#N/A"},{"$error":"#N/A"},{"$error":"#N/A"},{"$error":"#N/A"},{"$error":"#N/A"},{"$error":"#N/A"},{"$error":"#N/A"},{"$error":"#N/A"}]
[null,null,null,null,null,null,null,null,null,null,null,257,{"$f":"MAX(IF(OR(kcjd<jdplant1,kcjd>jdplant1+C$22),0,kc.ini.1),M623)","v":0},{"$f":"MAX(IF(OR(kcjd<jdplant1+C$22,kcjd>jdplant1+SUM(C$22,D$22)),0,+H$22+(kcjd-(jdplant1+C$22))/(jdplant1+SUM(C$22,D$22)-(jdplant1+C$22))*(I$22-H$22)),N623)","v":0},{"$f":"MAX(IF(OR(kcjd<jdplant1+SUM(C$22,D$22),kcjd>jdplant1+SUM(C$22,D$22,E$22)),0,kc.mid.1),O623)","v":0},{"$f":"MAX(IF(OR(kcjd<jdplant1+SUM(C$22:E$22),kcjd>jdplant1+G$22),0,+I$22-(kcjd-(jdplant1+SUM(C$22:E$22)))/((jdplant1+G$22)-(jdplant1+SUM(C$22:E$22)))*(I$22-J$22)),P623)","v":0},0,{"$f":"MAX(IF(OR(kcjd<jdplant2,kcjd>jdplant2+$C$23),0,kc.ini.2),R623)","v":{"$error":"#N/A"}},{"$f":"MAX(IF(OR(kcjd<jdplant2+$C$23,kcjd>jdplant2+SUM($C$23,$D$23)),0,+kc.ini.2+(kcjd-(jdplant2+$C$23))/(jdplant2+SUM($C$23,$D$23)-(jdplant2+$C$23))*(kc.mid.2-kc.ini.2)),S623)","v":{"$error":"#N/A"}},{"$f":"MAX(IF(OR(kcjd<jdplant2+SUM($C$23,$D$23),kcjd>jdplant2+SUM($C$23,$D$23,$E$23)),0,kc.mid.2),T623)","v":{"$error":"#N/A"}},{"$f":"MAX(IF(OR(kcjd<jdplant2+SUM($C$23:$E$23),kcjd>jdplant2+$G$23),0,+kc.mid.2-(kcjd-(jdplant2+SUM($C$23:$E$23)))/((jdplant2+$G$23)-(jdplant2+SUM($C$23:$E$23)))*(kc.mid.2-kc.late.2)),U623)","v":{"$error":"#N/A"}},{"$error":"#N/A"},{"$f":"MAX(IF(OR(kcjd<jdplant3,kcjd>jdplant3+$C$24),0,kc.ini.3),W623)","v":{"$error":"#N/A"}},{"$f":"MAX(IF(OR(kcjd<jdplant3+$C$24,kcjd>jdplant3+SUM($C$24,$D$24)),0,+kc.ini.3+(kcjd-(jdplant3+$C$24))/(jdplant3+SUM($C$24,$D$24)-(jdplant3+$C$24))*(kc.mid.3-kc.ini.3)),X623)","v":{"$error":"#N/A"}},{"$f":"MAX(IF(OR(kcjd<jdplant3+SUM($C$24,$D$24),kcjd>jdplant3+SUM($C$24,$D$24,$E$24)),0,kc.mid.3),Y623)","v":{"$error":"#N/A"}},{"$f":"MAX(IF(OR(kcjd<jdplant3+SUM($C$24:$E$24),kcjd>jdplant3+$G$24),0,+kc.mid.3-(kcjd-(jdplant3+SUM($C$24:$E$24)))/((jdplant3+$G$24)-(jdplant3+SUM($C$24:$E$24)))*(kc.mid.3-kc.late.3)),Z623)","v":{"$error":"#N/A"}},{"$error":"#N/A"}]
[null,null,null,null,null,null,null,null,null,null,null,258,0,0,0,0,{"$f":"MAX(M259:P259)","v":0},{"$error":"#N/A"},{"$error":"#N/A"},{"$error":"#N/A"},{"$error":"#N/A"},{"$f":"MAX(R259:U259)","v":{"$error":"#N/A"}},{"$error":"#N/A"},{"$error":"#N/A"},{"$error":"#N/A"},{"$error":"#N/A"},{"$f":"MAX(W259:Z259)","v":{"$error":"#N/A"}}]
[null,null,null,null,null,null,null,null,null,null,null,259,0,0,0,0,0,{"$error":"#N/A"},{"$error":"#N/A"},{"$error":"#N/A"},{"$error":"#N/A"},{"$error":"#N/A"},{"$error":"#N/A"},{"$error":"#N/A"},{"$error":"#N/A"},{"$error":"#N/A"},{"$error":"#N/A"}]
[null,null,null,null,null,null,null,null,null,null,null,260,0,0,0,0,0,{"$error":"#N/A"},{"$error":"#N/A"},{"$error":"#N/A"},{"$error":"#N/A"},{"$error":"#N/A"},{"$error":"#N/A"},{"$error":"#N/A"},{"$error":"#N/A"},{"$error":"#N/A"},{"$error":"#N/A"}]
[null,null,null,null,null,null,null,null,null,null,null,261,0,0,0,0,0,{"$error":"#N/A"},{"$error":"#N/A"},{"$error":"#N/A"},{"$error":"#N/A"},{"$error":"#N/A"},{"$error":"#N/A"},{"$error":"#N/A"},{"$error":"#N/A"},{"$error":"#N/A"},{"$error":"#N/A"}]
[null,null,null,null,null,null,null,null,null,null,null,262,0,0,0,0,0,{"$error":"#N/A"},{"$error":"#N/A"},{"$error":"#N/A"},{"$error":"#N/A"},{"$error":"#N/A"},{"$error":"#N/A"},{"$error":"#N/A"},{"$error":"#N/A"},{"$error":"#N/A"},{"$error":"#N/A"}]
[null,null,null,null,null,null,null,null,null,null,null,263,0,0,0,0,0,{"$error":"#N/A"},{"$error":"#N/A"},{"$error":"#N/A"},{"$error":"#N/A"},{"$error":"#N/A"},{"$error":"#N/A"},{"$error":"#N/A"},{"$error":"#N/A"},{"$error":"#N/A"},{"$error":"#N/A"}]
[null,null,null,null,null,null,null,null,null,null,null,264,0,0,0,0,0,{"$error":"#N/A"},{"$error":"#N/A"},{"$error":"#N/A"},{"$error":"#N/A"},{"$error":"#N/A"},{"$error":"#N/A"},{"$error":"#N/A"},{"$error":"#N/A"},{"$error":"#N/A"},{"$error":"#N/A"}]
[null,null,null,null,null,null,null,null,null,null,null,265,0,0,0,0,0,{"$error":"#N/A"},{"$error":"#N/A"},{"$error":"#N/A"},{"$error":"#N/A"},{"$error":"#N/A"},{"$error":"#N/A"},{"$error":"#N/A"},{"$error":"#N/A"},{"$error":"#N/A"},{"$error":"#N/A"}]
[null,null,null,null,null,null,null,null,null,null,null,266,0,0,0,0,0,{"$error":"#N/A"},{"$error":"#N/A"},{"$error":"#N/A"},{"$error":"#N/A"},{"$error":"#N/A"},{"$error":"#N/A"},{"$error":"#N/A"},{"$error":"#N/A"},{"$error":"#N/A"},{"$error":"#N/A"}]
[null,null,null,null,null,null,null,null,null,null,null,267,0,0,0,0,0,{"$error":"#N/A"},{"$error":"#N/A"},{"$error":"#N/A"},{"$error":"#N/A"},{"$error":"#N/A"},{"$error":"#N/A"},{"$error":"#N/A"},{"$error":"#N/A"},{"$error":"#N/A"},{"$error":"#N/A"}]
[null,null,null,null,null,null,null,null,null,null,null,268,0,0,0,0,0,{"$error":"#N/A"},{"$error":"#N/A"},{"$error":"#N/A"},{"$error":"#N/A"},{"$error":"#N/A"},{"$error":"#N/A"},{"$error":"#N/A"},{"$error":"#N/A"},{"$error":"#N/A"},{"$error":"#N/A"}]
[null,null,null,null,null,null,null,null,null,null,null,269,0,0,0,0,0,{"$error":"#N/A"},{"$error":"#N/A"},{"$error":"#N/A"},{"$error":"#N/A"},{"$error":"#N/A"},{"$error":"#N/A"},{"$error":"#N/A"},{"$error":"#N/A"},{"$error":"#N/A"},{"$error":"#N/A"}]
[null,null,null,null,null,null,null,null,null,null,null,270,0,0,0,0,0,{"$error":"#N/A"},{"$error":"#N/A"},{"$error":"#N/A"},{"$error":"#N/A"},{"$error":"#N/A"},{"$error":"#N/A"},{"$error":"#N/A"},{"$error":"#N/A"},{"$error":"#N/A"},{"$error":"#N/A"}]
[null,null,null,null,null,null,null,null,null,null,null,271,0,0,0,0,0,{"$error":"#N/A"},{"$error":"#N/A"},{"$error":"#N/A"},{"$error":"#N/A"},{"$error":"#N/A"},{"$error":"#N/A"},{"$error":"#N/A"},{"$error":"#N/A"},{"$error":"#N/A"},{"$error":"#N/A"}]
[null,null,null,null,null,null,null,null,null,null,null,272,0,0,0,0,0,{"$error":"#N/A"},{"$error":"#N/A"},{"$error":"#N/A"},{"$error":"#N/A"},{"$error":"#N/A"},{"$error":"#N/A"},{"$error":"#N/A"},{"$error":"#N/A"},{"$error":"#N/A"},{"$error":"#N/A"}]
[null,null,null,null,null,null,null,null,null,null,null,273,0,0,0,0,0,{"$error":"#N/A"},{"$error":"#N/A"},{"$error":"#N/A"},{"$error":"#N/A"},{"$error":"#N/A"},{"$error":"#N/A"},{"$error":"#N/A"},{"$error":"#N/A"},{"$error":"#N/A"},{"$error":"#N/A"}]
[null,null,null,null,null,null,null,null,null,null,null,274,0,0,0,0,0,{"$error":"#N/A"},{"$error":"#N/A"},{"$error":"#N/A"},{"$error":"#N/A"},{"$error":"#N/A"},{"$error":"#N/A"},{"$error":"#N/A"},{"$error":"#N/A"},{"$error":"#N/A"},{"$error":"#N/A"}]
[null,null,null,null,null,null,null,null,null,null,null,275,0,0,0,0,0,{"$error":"#N/A"},{"$error":"#N/A"},{"$error":"#N/A"},{"$error":"#N/A"},{"$error":"#N/A"},{"$error":"#N/A"},{"$error":"#N/A"},{"$error":"#N/A"},{"$error":"#N/A"},{"$error":"#N/A"}]
[null,null,null,null,null,null,null,null,null,null,null,276,0,0,0,0,0,{"$error":"#N/A"},{"$error":"#N/A"},{"$error":"#N/A"},{"$error":"#N/A"},{"$error":"#N/A"},{"$error":"#N/A"},{"$error":"#N/A"},{"$error":"#N/A"},{"$error":"#N/A"},{"$error":"#N/A"}]
[null,null,null,null,null,null,null,null,null,null,null,277,0,0,0,0,0,{"$error":"#N/A"},{"$error":"#N/A"},{"$error":"#N/A"},{"$error":"#N/A"},{"$error":"#N/A"},{"$error":"#N/A"},{"$error":"#N/A"},{"$error":"#N/A"},{"$error":"#N/A"},{"$error":"#N/A"}]
[null,null,null,null,null,null,null,null,null,null,null,278,0,0,0,0,0,{"$error":"#N/A"},{"$error":"#N/A"},{"$error":"#N/A"},{"$error":"#N/A"},{"$error":"#N/A"},{"$error":"#N/A"},{"$error":"#N/A"},{"$error":"#N/A"},{"$error":"#N/A"},{"$error":"#N/A"}]
[null,null,null,null,null,null,null,null,null,null,null,279,0,0,0,0,0,{"$error":"#N/A"},{"$error":"#N/A"},{"$error":"#N/A"},{"$error":"#N/A"},{"$error":"#N/A"},{"$error":"#N/A"},{"$error":"#N/A"},{"$error":"#N/A"},{"$error":"#N/A"},{"$error":"#N/A"}]
[null,null,null,null,null,null,null,null,null,null,null,280,0,0,0,0,0,{"$error":"#N/A"},{"$error":"#N/A"},{"$error":"#N/A"},{"$error":"#N/A"},{"$error":"#N/A"},{"$error":"#N/A"},{"$error":"#N/A"},{"$error":"#N/A"},{"$error":"#N/A"},{"$error":"#N/A"}]
[null,null,null,null,null,null,null,null,null,null,null,281,0,0,0,0,0,{"$error":"#N/A"},{"$error":"#N/A"},{"$error":"#N/A"},{"$error":"#N/A"},{"$error":"#N/A"},{"$error":"#N/A"},{"$error":"#N/A"},{"$error":"#N/A"},{"$error":"#N/A"},{"$error":"#N/A"}]
[null,null,null,null,null,null,null,null,null,null,null,282,0,0,0,0,0,{"$error":"#N/A"},{"$error":"#N/A"},{"$error":"#N/A"},{"$error":"#N/A"},{"$error":"#N/A"},{"$error":"#N/A"},{"$error":"#N/A"},{"$error":"#N/A"},{"$error":"#N/A"},{"$error":"#N/A"}]
[null,null,null,null,null,null,null,null,null,null,null,283,0,0,0,0,0,{"$error":"#N/A"},{"$error":"#N/A"},{"$error":"#N/A"},{"$error":"#N/A"},{"$error":"#N/A"},{"$error":"#N/A"},{"$error":"#N/A"},{"$error":"#N/A"},{"$error":"#N/A"},{"$error":"#N/A"}]
[null,null,null,null,null,null,null,null,null,null,null,284,0,0,0,0,0,{"$error":"#N/A"},{"$error":"#N/A"},{"$error":"#N/A"},{"$error":"#N/A"},{"$error":"#N/A"},{"$error":"#N/A"},{"$error":"#N/A"},{"$error":"#N/A"},{"$error":"#N/A"},{"$error":"#N/A"}]
[null,null,null,null,null,null,null,null,null,null,null,285,0,0,0,0,0,{"$error":"#N/A"},{"$error":"#N/A"},{"$error":"#N/A"},{"$error":"#N/A"},{"$error":"#N/A"},{"$error":"#N/A"},{"$error":"#N/A"},{"$error":"#N/A"},{"$error":"#N/A"},{"$error":"#N/A"}]
[null,null,null,null,null,null,null,null,null,null,null,286,0,0,0,0,0,{"$error":"#N/A"},{"$error":"#N/A"},{"$error":"#N/A"},{"$error":"#N/A"},{"$error":"#N/A"},{"$error":"#N/A"},{"$error":"#N/A"},{"$error":"#N/A"},{"$error":"#N/A"},{"$error":"#N/A"}]
[null,null,null,null,null,null,null,null,null,null,null,287,0,0,0,0,0,{"$error":"#N/A"},{"$error":"#N/A"},{"$error":"#N/A"},{"$error":"#N/A"},{"$error":"#N/A"},{"$error":"#N/A"},{"$error":"#N/A"},{"$error":"#N/A"},{"$error":"#N/A"},{"$error":"#N/A"}]
[null,null,null,null,null,null,null,null,null,null,null,288,0,0,0,0,0,{"$error":"#N/A"},{"$error":"#N/A"},{"$error":"#N/A"},{"$error":"#N/A"},{"$error":"#N/A"},{"$error":"#N/A"},{"$error":"#N/A"},{"$error":"#N/A"},{"$error":"#N/A"},{"$error":"#N/A"}]
[null,null,null,null,null,null,null,null,null,null,null,289,0,0,0,0,0,{"$error":"#N/A"},{"$error":"#N/A"},{"$error":"#N/A"},{"$error":"#N/A"},{"$error":"#N/A"},{"$error":"#N/A"},{"$error":"#N/A"},{"$error":"#N/A"},{"$error":"#N/A"},{"$error":"#N/A"}]
[null,null,null,null,null,null,null,null,null,null,null,290,0,0,0,0,0,{"$error":"#N/A"},{"$error":"#N/A"},{"$error":"#N/A"},{"$error":"#N/A"},{"$error":"#N/A"},{"$error":"#N/A"},{"$error":"#N/A"},{"$error":"#N/A"},{"$error":"#N/A"},{"$error":"#N/A"}]
[null,null,null,null,null,null,null,null,null,null,null,291,0,0,0,0,0,{"$error":"#N/A"},{"$error":"#N/A"},{"$error":"#N/A"},{"$error":"#N/A"},{"$error":"#N/A"},{"$error":"#N/A"},{"$error":"#N/A"},{"$error":"#N/A"},{"$error":"#N/A"},{"$error":"#N/A"}]
[null,null,null,null,null,null,null,null,null,null,null,292,0,0,0,0,0,{"$error":"#N/A"},{"$error":"#N/A"},{"$error":"#N/A"},{"$error":"#N/A"},{"$error":"#N/A"},{"$error":"#N/A"},{"$error":"#N/A"},{"$error":"#N/A"},{"$error":"#N/A"},{"$error":"#N/A"}]
[null,null,null,null,null,null,null,null,null,null,null,293,0,0,0,0,0,{"$error":"#N/A"},{"$error":"#N/A"},{"$error":"#N/A"},{"$error":"#N/A"},{"$error":"#N/A"},{"$error":"#N/A"},{"$error":"#N/A"},{"$error":"#N/A"},{"$error":"#N/A"},{"$error":"#N/A"}]
[null,null,null,null,null,null,null,null,null,null,null,294,0,0,0,0,0,{"$error":"#N/A"},{"$error":"#N/A"},{"$error":"#N/A"},{"$error":"#N/A"},{"$error":"#N/A"},{"$error":"#N/A"},{"$error":"#N/A"},{"$error":"#N/A"},{"$error":"#N/A"},{"$error":"#N/A"}]
[null,null,null,null,null,null,null,null,null,null,null,295,0,0,0,0,0,{"$error":"#N/A"},{"$error":"#N/A"},{"$error":"#N/A"},{"$error":"#N/A"},{"$error":"#N/A"},{"$error":"#N/A"},{"$error":"#N/A"},{"$error":"#N/A"},{"$error":"#N/A"},{"$error":"#N/A"}]
[null,null,null,null,null,null,null,null,null,null,null,296,0,0,0,0,0,{"$error":"#N/A"},{"$error":"#N/A"},{"$error":"#N/A"},{"$error":"#N/A"},{"$error":"#N/A"},{"$error":"#N/A"},{"$error":"#N/A"},{"$error":"#N/A"},{"$error":"#N/A"},{"$error":"#N/A"}]
[null,null,null,null,null,null,null,null,null,null,null,297,0,0,0,0,0,{"$error":"#N/A"},{"$error":"#N/A"},{"$error":"#N/A"},{"$error":"#N/A"},{"$error":"#N/A"},{"$error":"#N/A"},{"$error":"#N/A"},{"$error":"#N/A"},{"$error":"#N/A"},{"$error":"#N/A"}]
[null,null,null,null,null,null,null,null,null,null,null,298,0,0,0,0,0,{"$error":"#N/A"},{"$error":"#N/A"},{"$error":"#N/A"},{"$error":"#N/A"},{"$error":"#N/A"},{"$error":"#N/A"},{"$error":"#N/A"},{"$error":"#N/A"},{"$error":"#N/A"},{"$error":"#N/A"}]
[null,null,null,null,null,null,null,null,null,null,null,299,0,0,0,0,0,{"$error":"#N/A"},{"$error":"#N/A"},{"$error":"#N/A"},{"$error":"#N/A"},{"$error":"#N/A"},{"$error":"#N/A"},{"$error":"#N/A"},{"$error":"#N/A"},{"$error":"#N/A"},{"$error":"#N/A"}]
[null,null,null,null,null,null,null,null,null,null,null,300,0,0,0,0,0,{"$error":"#N/A"},{"$error":"#N/A"},{"$error":"#N/A"},{"$error":"#N/A"},{"$error":"#N/A"},{"$error":"#N/A"},{"$error":"#N/A"},{"$error":"#N/A"},{"$error":"#N/A"},{"$error":"#N/A"}]
[null,null,null,null,null,null,null,null,null,null,null,301,0,0,0,0,0,{"$error":"#N/A"},{"$error":"#N/A"},{"$error":"#N/A"},{"$error":"#N/A"},{"$error":"#N/A"},{"$error":"#N/A"},{"$error":"#N/A"},{"$error":"#N/A"},{"$error":"#N/A"},{"$error":"#N/A"}]
[null,null,null,null,null,null,null,null,null,null,null,302,0,0,0,0,0,{"$error":"#N/A"},{"$error":"#N/A"},{"$error":"#N/A"},{"$error":"#N/A"},{"$error":"#N/A"},{"$error":"#N/A"},{"$error":"#N/A"},{"$error":"#N/A"},{"$error":"#N/A"},{"$error":"#N/A"}]
[null,null,null,null,null,null,null,null,null,null,null,303,0,0,0,0,0,{"$error":"#N/A"},{"$error":"#N/A"},{"$error":"#N/A"},{"$error":"#N/A"},{"$error":"#N/A"},{"$error":"#N/A"},{"$error":"#N/A"},{"$error":"#N/A"},{"$error":"#N/A"},{"$error":"#N/A"}]
[null,null,null,null,null,null,null,null,null,null,null,304,0,0,0,0,0,{"$error":"#N/A"},{"$error":"#N/A"},{"$error":"#N/A"},{"$error":"#N/A"},{"$error":"#N/A"},{"$error":"#N/A"},{"$error":"#N/A"},{"$error":"#N/A"},{"$error":"#N/A"},{"$error":"#N/A"}]
[null,null,null,null,null,null,null,null,null,null,null,305,0,0,0,0,0,{"$error":"#N/A"},{"$error":"#N/A"},{"$error":"#N/A"},{"$error":"#N/A"},{"$error":"#N/A"},{"$error":"#N/A"},{"$error":"#N/A"},{"$error":"#N/A"},{"$error":"#N/A"},{"$error":"#N/A"}]
[null,null,null,null,null,null,null,null,null,null,null,306,0,0,0,0,0,{"$error":"#N/A"},{"$error":"#N/A"},{"$error":"#N/A"},{"$error":"#N/A"},{"$error":"#N/A"},{"$error":"#N/A"},{"$error":"#N/A"},{"$error":"#N/A"},{"$error":"#N/A"},{"$error":"#N/A"}]
[null,null,null,null,null,null,null,null,null,null,null,307,0,0,0,0,0,{"$error":"#N/A"},{"$error":"#N/A"},{"$error":"#N/A"},{"$error":"#N/A"},{"$error":"#N/A"},{"$error":"#N/A"},{"$error":"#N/A"},{"$error":"#N/A"},{"$error":"#N/A"},{"$error":"#N/A"}]
[null,null,null,null,null,null,null,null,null,null,null,308,0,0,0,0,0,{"$error":"#N/A"},{"$error":"#N/A"},{"$error":"#N/A"},{"$error":"#N/A"},{"$error":"#N/A"},{"$error":"#N/A"},{"$error":"#N/A"},{"$error":"#N/A"},{"$error":"#N/A"},{"$error":"#N/A"}]
[null,null,null,null,null,null,null,null,null,null,null,309,0,0,0,0,0,{"$error":"#N/A"},{"$error":"#N/A"},{"$error":"#N/A"},{"$error":"#N/A"},{"$error":"#N/A"},{"$error":"#N/A"},{"$error":"#N/A"},{"$error":"#N/A"},{"$error":"#N/A"},{"$error":"#N/A"}]
[null,null,null,null,null,null,null,null,null,null,null,310,0,0,0,0,0,{"$error":"#N/A"},{"$error":"#N/A"},{"$error":"#N/A"},{"$error":"#N/A"},{"$error":"#N/A"},{"$error":"#N/A"},{"$error":"#N/A"},{"$error":"#N/A"},{"$error":"#N/A"},{"$error":"#N/A"}]
[null,null,null,null,null,null,null,null,null,null,null,311,0,0,0,0,0,{"$error":"#N/A"},{"$error":"#N/A"},{"$error":"#N/A"},{"$error":"#N/A"},{"$error":"#N/A"},{"$error":"#N/A"},{"$error":"#N/A"},{"$error":"#N/A"},{"$error":"#N/A"},{"$error":"#N/A"}]
[null,null,null,null,null,null,null,null,null,null,null,312,0,0,0,0,0,{"$error":"#N/A"},{"$error":"#N/A"},{"$error":"#N/A"},{"$error":"#N/A"},{"$error":"#N/A"},{"$error":"#N/A"},{"$error":"#N/A"},{"$error":"#N/A"},{"$error":"#N/A"},{"$error":"#N/A"}]
[null,null,null,null,null,null,null,null,null,null,null,313,0,0,0,0,0,{"$error":"#N/A"},{"$error":"#N/A"},{"$error":"#N/A"},{"$error":"#N/A"},{"$error":"#N/A"},{"$error":"#N/A"},{"$error":"#N/A"},{"$error":"#N/A"},{"$error":"#N/A"},{"$error":"#N/A"}]
[null,null,null,null,null,null,null,null,null,null,null,314,0,0,0,0,0,{"$error":"#N/A"},{"$error":"#N/A"},{"$error":"#N/A"},{"$error":"#N/A"},{"$error":"#N/A"},{"$error":"#N/A"},{"$error":"#N/A"},{"$error":"#N/A"},{"$error":"#N/A"},{"$error":"#N/A"}]
[null,null,null,null,null,null,null,null,null,null,null,315,0,0,0,0,0,{"$error":"#N/A"},{"$error":"#N/A"},{"$error":"#N/A"},{"$error":"#N/A"},{"$error":"#N/A"},{"$error":"#N/A"},{"$error":"#N/A"},{"$error":"#N/A"},{"$error":"#N/A"},{"$error":"#N/A"}]
[null,null,null,null,null,null,null,null,null,null,null,316,0,0,0,0,0,{"$error":"#N/A"},{"$error":"#N/A"},{"$error":"#N/A"},{"$error":"#N/A"},{"$error":"#N/A"},{"$error":"#N/A"},{"$error":"#N/A"},{"$error":"#N/A"},{"$error":"#N/A"},{"$error":"#N/A"}]
[null,null,null,null,null,null,null,null,null,null,null,317,0,0,0,0,0,{"$error":"#N/A"},{"$error":"#N/A"},{"$error":"#N/A"},{"$error":"#N/A"},{"$error":"#N/A"},{"$error":"#N/A"},{"$error":"#N/A"},{"$error":"#N/A"},{"$error":"#N/A"},{"$error":"#N/A"}]
[null,null,null,null,null,null,null,null,null,null,null,318,0,0,0,0,0,{"$error":"#N/A"},{"$error":"#N/A"},{"$error":"#N/A"},{"$error":"#N/A"},{"$error":"#N/A"},{"$error":"#N/A"},{"$error":"#N/A"},{"$error":"#N/A"},{"$error":"#N/A"},{"$error":"#N/A"}]
[null,null,null,null,null,null,null,null,null,null,null,319,0,0,0,0,0,{"$error":"#N/A"},{"$error":"#N/A"},{"$error":"#N/A"},{"$error":"#N/A"},{"$error":"#N/A"},{"$error":"#N/A"},{"$error":"#N/A"},{"$error":"#N/A"},{"$error":"#N/A"},{"$error":"#N/A"}]
[null,null,null,null,null,null,null,null,null,null,null,320,0,0,0,0,0,{"$error":"#N/A"},{"$error":"#N/A"},{"$error":"#N/A"},{"$error":"#N/A"},{"$error":"#N/A"},{"$error":"#N/A"},{"$error":"#N/A"},{"$error":"#N/A"},{"$error":"#N/A"},{"$error":"#N/A"}]
[null,null,null,null,null,null,null,null,null,null,null,321,{"$f":"MAX(IF(OR(kcjd<jdplant1,kcjd>jdplant1+C$22),0,kc.ini.1),M687)","v":0},{"$f":"MAX(IF(OR(kcjd<jdplant1+C$22,kcjd>jdplant1+SUM(C$22,D$22)),0,+H$22+(kcjd-(jdplant1+C$22))/(jdplant1+SUM(C$22,D$22)-(jdplant1+C$22))*(I$22-H$22)),N687)","v":0},{"$f":"MAX(IF(OR(kcjd<jdplant1+SUM(C$22,D$22),kcjd>jdplant1+SUM(C$22,D$22,E$22)),0,kc.mid.1),O687)","v":0},{"$f":"MAX(IF(OR(kcjd<jdplant1+SUM(C$22:E$22),kcjd>jdplant1+G$22),0,+I$22-(kcjd-(jdplant1+SUM(C$22:E$22)))/((jdplant1+G$22)-(jdplant1+SUM(C$22:E$22)))*(I$22-J$22)),P687)","v":0},0,{"$f":"MAX(IF(OR(kcjd<jdplant2,kcjd>jdplant2+$C$23),0,kc.ini.2),R687)","v":{"$error":"#N/A"}},{"$f":"MAX(IF(OR(kcjd<jdplant2+$C$23,kcjd>jdplant2+SUM($C$23,$D$23)),0,+kc.ini.2+(kcjd-(jdplant2+$C$23))/(jdplant2+SUM($C$23,$D$23)-(jdplant2+$C$23))*(kc.mid.2-kc.ini.2)),S687)","v":{"$error":"#N/A"}},{"$f":"MAX(IF(OR(kcjd<jdplant2+SUM($C$23,$D$23),kcjd>jdplant2+SUM($C$23,$D$23,$E$23)),0,kc.mid.2),T687)","v":{"$error":"#N/A"}},{"$f":"MAX(IF(OR(kcjd<jdplant2+SUM($C$23:$E$23),kcjd>jdplant2+$G$23),0,+kc.mid.2-(kcjd-(jdplant2+SUM($C$23:$E$23)))/((jdplant2+$G$23)-(jdplant2+SUM($C$23:$E$23)))*(kc.mid.2-kc.late.2)),U687)","v":{"$error":"#N/A"}},{"$error":"#N/A"},{"$f":"MAX(IF(OR(kcjd<jdplant3,kcjd>jdplant3+$C$24),0,kc.ini.3),W687)","v":{"$error":"#N/A"}},{"$f":"MAX(IF(OR(kcjd<jdplant3+$C$24,kcjd>jdplant3+SUM($C$24,$D$24)),0,+kc.ini.3+(kcjd-(jdplant3+$C$24))/(jdplant3+SUM($C$24,$D$24)-(jdplant3+$C$24))*(kc.mid.3-kc.ini.3)),X687)","v":{"$error":"#N/A"}},{"$f":"MAX(IF(OR(kcjd<jdplant3+SUM($C$24,$D$24),kcjd>jdplant3+SUM($C$24,$D$24,$E$24)),0,kc.mid.3),Y687)","v":{"$error":"#N/A"}},{"$f":"MAX(IF(OR(kcjd<jdplant3+SUM($C$24:$E$24),kcjd>jdplant3+$G$24),0,+kc.mid.3-(kcjd-(jdplant3+SUM($C$24:$E$24)))/((jdplant3+$G$24)-(jdplant3+SUM($C$24:$E$24)))*(kc.mid.3-kc.late.3)),Z687)","v":{"$error":"#N/A"}},{"$error":"#N/A"}]
[null,null,null,null,null,null,null,null,null,null,null,322,0,0,0,0,{"$f":"MAX(M323:P323)","v":0},{"$error":"#N/A"},{"$error":"#N/A"},{"$error":"#N/A"},{"$error":"#N/A"},{"$f":"MAX(R323:U323)","v":{"$error":"#N/A"}},{"$error":"#N/A"},{"$error":"#N/A"},{"$error":"#N/A"},{"$error":"#N/A"},{"$f":"MAX(W323:Z323)","v":{"$error":"#N/A"}}]
[null,null,null,null,null,null,null,null,null,null,null,323,0,0,0,0,0,{"$error":"#N/A"},{"$error":"#N/A"},{"$error":"#N/A"},{"$error":"#N/A"},{"$error":"#N/A"},{"$error":"#N/A"},{"$error":"#N/A"},{"$error":"#N/A"},{"$error":"#N/A"},{"$error":"#N/A"}]
[null,null,null,null,null,null,null,null,null,null,null,324,0,0,0,0,0,{"$error":"#N/A"},{"$error":"#N/A"},{"$error":"#N/A"},{"$error":"#N/A"},{"$error":"#N/A"},{"$error":"#N/A"},{"$error":"#N/A"},{"$error":"#N/A"},{"$error":"#N/A"},{"$error":"#N/A"}]
[null,null,null,null,null,null,null,null,null,null,null,325,0,0,0,0,0,{"$error":"#N/A"},{"$error":"#N/A"},{"$error":"#N/A"},{"$error":"#N/A"},{"$error":"#N/A"},{"$error":"#N/A"},{"$error":"#N/A"},{"$error":"#N/A"},{"$error":"#N/A"},{"$error":"#N/A"}]
[null,null,null,null,null,null,null,null,null,null,null,326,0,0,0,0,0,{"$error":"#N/A"},{"$error":"#N/A"},{"$error":"#N/A"},{"$error":"#N/A"},{"$error":"#N/A"},{"$error":"#N/A"},{"$error":"#N/A"},{"$error":"#N/A"},{"$error":"#N/A"},{"$error":"#N/A"}]
[null,null,null,null,null,null,null,null,null,null,null,327,0,0,0,0,0,{"$error":"#N/A"},{"$error":"#N/A"},{"$error":"#N/A"},{"$error":"#N/A"},{"$error":"#N/A"},{"$error":"#N/A"},{"$error":"#N/A"},{"$error":"#N/A"},{"$error":"#N/A"},{"$error":"#N/A"}]
[null,null,null,null,null,null,null,null,null,null,null,328,0,0,0,0,0,{"$error":"#N/A"},{"$error":"#N/A"},{"$error":"#N/A"},{"$error":"#N/A"},{"$error":"#N/A"},{"$error":"#N/A"},{"$error":"#N/A"},{"$error":"#N/A"},{"$error":"#N/A"},{"$error":"#N/A"}]
[null,null,null,null,null,null,null,null,null,null,null,329,0,0,0,0,0,{"$error":"#N/A"},{"$error":"#N/A"},{"$error":"#N/A"},{"$error":"#N/A"},{"$error":"#N/A"},{"$error":"#N/A"},{"$error":"#N/A"},{"$error":"#N/A"},{"$error":"#N/A"},{"$error":"#N/A"}]
[null,null,null,null,null,null,null,null,null,null,null,330,0,0,0,0,0,{"$error":"#N/A"},{"$error":"#N/A"},{"$error":"#N/A"},{"$error":"#N/A"},{"$error":"#N/A"},{"$error":"#N/A"},{"$error":"#N/A"},{"$error":"#N/A"},{"$error":"#N/A"},{"$error":"#N/A"}]
[null,null,null,null,null,null,null,null,null,null,null,331,0,0,0,0,0,{"$error":"#N/A"},{"$error":"#N/A"},{"$error":"#N/A"},{"$error":"#N/A"},{"$error":"#N/A"},{"$error":"#N/A"},{"$error":"#N/A"},{"$error":"#N/A"},{"$error":"#N/A"},{"$error":"#N/A"}]
[null,null,null,null,null,null,null,null,null,null,null,332,0,0,0,0,0,{"$error":"#N/A"},{"$error":"#N/A"},{"$error":"#N/A"},{"$error":"#N/A"},{"$error":"#N/A"},{"$error":"#N/A"},{"$error":"#N/A"},{"$error":"#N/A"},{"$error":"#N/A"},{"$error":"#N/A"}]
[null,null,null,null,null,null,null,null,null,null,null,333,0,0,0,0,0,{"$error":"#N/A"},{"$error":"#N/A"},{"$error":"#N/A"},{"$error":"#N/A"},{"$error":"#N/A"},{"$error":"#N/A"},{"$error":"#N/A"},{"$error":"#N/A"},{"$error":"#N/A"},{"$error":"#N/A"}]
[null,null,null,null,null,null,null,null,null,null,null,334,0,0,0,0,0,{"$error":"#N/A"},{"$error":"#N/A"},{"$error":"#N/A"},{"$error":"#N/A"},{"$error":"#N/A"},{"$error":"#N/A"},{"$error":"#N/A"},{"$error":"#N/A"},{"$error":"#N/A"},{"$error":"#N/A"}]
[null,null,null,null,null,null,null,null,null,null,null,335,0,0,0,0,0,{"$error":"#N/A"},{"$error":"#N/A"},{"$error":"#N/A"},{"$error":"#N/A"},{"$error":"#N/A"},{"$error":"#N/A"},{"$error":"#N/A"},{"$error":"#N/A"},{"$error":"#N/A"},{"$error":"#N/A"}]
[null,null,null,null,null,null,null,null,null,null,null,336,0,0,0,0,0,{"$error":"#N/A"},{"$error":"#N/A"},{"$error":"#N/A"},{"$error":"#N/A"},{"$error":"#N/A"},{"$error":"#N/A"},{"$error":"#N/A"},{"$error":"#N/A"},{"$error":"#N/A"},{"$error":"#N/A"}]
[null,null,null,null,null,null,null,null,null,null,null,337,0,0,0,0,0,{"$error":"#N/A"},{"$error":"#N/A"},{"$error":"#N/A"},{"$error":"#N/A"},{"$error":"#N/A"},{"$error":"#N/A"},{"$error":"#N/A"},{"$error":"#N/A"},{"$error":"#N/A"},{"$error":"#N/A"}]
[null,null,null,null,null,null,null,null,null,null,null,338,0,0,0,0,0,{"$error":"#N/A"},{"$error":"#N/A"},{"$error":"#N/A"},{"$error":"#N/A"},{"$error":"#N/A"},{"$error":"#N/A"},{"$error":"#N/A"},{"$error":"#N/A"},{"$error":"#N/A"},{"$error":"#N/A"}]
[null,null,null,null,null,null,null,null,null,null,null,339,0,0,0,0,0,{"$error":"#N/A"},{"$error":"#N/A"},{"$error":"#N/A"},{"$error":"#N/A"},{"$error":"#N/A"},{"$error":"#N/A"},{"$error":"#N/A"},{"$error":"#N/A"},{"$error":"#N/A"},{"$error":"#N/A"}]
[null,null,null,null,null,null,null,null,null,null,null,340,0,0,0,0,0,{"$error":"#N/A"},{"$error":"#N/A"},{"$error":"#N/A"},{"$error":"#N/A"},{"$error":"#N/A"},{"$error":"#N/A"},{"$error":"#N/A"},{"$error":"#N/A"},{"$error":"#N/A"},{"$error":"#N/A"}]
[null,null,null,null,null,null,null,null,null,null,null,341,0,0,0,0,0,{"$error":"#N/A"},{"$error":"#N/A"},{"$error":"#N/A"},{"$error":"#N/A"},{"$error":"#N/A"},{"$error":"#N/A"},{"$error":"#N/A"},{"$error":"#N/A"},{"$error":"#N/A"},{"$error":"#N/A"}]
[null,null,null,null,null,null,null,null,null,null,null,342,0,0,0,0,0,{"$error":"#N/A"},{"$error":"#N/A"},{"$error":"#N/A"},{"$error":"#N/A"},{"$error":"#N/A"},{"$error":"#N/A"},{"$error":"#N/A"},{"$error":"#N/A"},{"$error":"#N/A"},{"$error":"#N/A"}]
[null,null,null,null,null,null,null,null,null,null,null,343,0,0,0,0,0,{"$error":"#N/A"},{"$error":"#N/A"},{"$error":"#N/A"},{"$error":"#N/A"},{"$error":"#N/A"},{"$error":"#N/A"},{"$error":"#N/A"},{"$error":"#N/A"},{"$error":"#N/A"},{"$error":"#N/A"}]
[null,null,null,null,null,null,null,null,null,null,null,344,0,0,0,0,0,{"$error":"#N/A"},{"$error":"#N/A"},{"$error":"#N/A"},{"$error":"#N/A"},{"$error":"#N/A"},{"$error":"#N/A"},{"$error":"#N/A"},{"$error":"#N/A"},{"$error":"#N/A"},{"$error":"#N/A"}]
[null,null,null,null,null,null,null,null,null,null,null,345,0,0,0,0,0,{"$error":"#N/A"},{"$error":"#N/A"},{"$error":"#N/A"},{"$error":"#N/A"},{"$error":"#N/A"},{"$error":"#N/A"},{"$error":"#N/A"},{"$error":"#N/A"},{"$error":"#N/A"},{"$error":"#N/A"}]
[null,null,null,null,null,null,null,null,null,null,null,346,0,0,0,0,0,{"$error":"#N/A"},{"$error":"#N/A"},{"$error":"#N/A"},{"$error":"#N/A"},{"$error":"#N/A"},{"$error":"#N/A"},{"$error":"#N/A"},{"$error":"#N/A"},{"$error":"#N/A"},{"$error":"#N/A"}]
[null,null,null,null,null,null,null,null,null,null,null,347,0,0,0,0,0,{"$error":"#N/A"},{"$error":"#N/A"},{"$error":"#N/A"},{"$error":"#N/A"},{"$error":"#N/A"},{"$error":"#N/A"},{"$error":"#N/A"},{"$error":"#N/A"},{"$error":"#N/A"},{"$error":"#N/A"}]
[null,null,null,null,null,null,null,null,null,null,null,348,0,0,0,0,0,{"$error":"#N/A"},{"$error":"#N/A"},{"$error":"#N/A"},{"$error":"#N/A"},{"$error":"#N/A"},{"$error":"#N/A"},{"$error":"#N/A"},{"$error":"#N/A"},{"$error":"#N/A"},{"$error":"#N/A"}]
[null,null,null,null,null,null,null,null,null,null,null,349,0,0,0,0,0,{"$error":"#N/A"},{"$error":"#N/A"},{"$error":"#N/A"},{"$error":"#N/A"},{"$error":"#N/A"},{"$error":"#N/A"},{"$error":"#N/A"},{"$error":"#N/A"},{"$error":"#N/A"},{"$error":"#N/A"}]
[null,null,null,null,null,null,null,null,null,null,null,350,0,0,0,0,0,{"$error":"#N/A"},{"$error":"#N/A"},{"$error":"#N/A"},{"$error":"#N/A"},{"$error":"#N/A"},{"$error":"#N/A"},{"$error":"#N/A"},{"$error":"#N/A"},{"$error":"#N/A"},{"$error":"#N/A"}]
[null,null,null,null,null,null,null,null,null,null,null,351,0,0,0,0,0,{"$error":"#N/A"},{"$error":"#N/A"},{"$error":"#N/A"},{"$error":"#N/A"},{"$error":"#N/A"},{"$error":"#N/A"},{"$error":"#N/A"},{"$error":"#N/A"},{"$error":"#N/A"},{"$error":"#N/A"}]
[null,null,null,null,null,null,null,null,null,null,null,352,0,0,0,0,0,{"$error":"#N/A"},{"$error":"#N/A"},{"$error":"#N/A"},{"$error":"#N/A"},{"$error":"#N/A"},{"$error":"#N/A"},{"$error":"#N/A"},{"$error":"#N/A"},{"$error":"#N/A"},{"$error":"#N/A"}]
[null,null,null,null,null,null,null,null,null,null,null,353,0,0,0,0,0,{"$error":"#N/A"},{"$error":"#N/A"},{"$error":"#N/A"},{"$error":"#N/A"},{"$error":"#N/A"},{"$error":"#N/A"},{"$error":"#N/A"},{"$error":"#N/A"},{"$error":"#N/A"},{"$error":"#N/A"}]
[null,null,null,null,null,null,null,null,null,null,null,354,0,0,0,0,0,{"$error":"#N/A"},{"$error":"#N/A"},{"$error":"#N/A"},{"$error":"#N/A"},{"$error":"#N/A"},{"$error":"#N/A"},{"$error":"#N/A"},{"$error":"#N/A"},{"$error":"#N/A"},{"$error":"#N/A"}]
[null,null,null,null,null,null,null,null,null,null,null,355,0,0,0,0,0,{"$error":"#N/A"},{"$error":"#N/A"},{"$error":"#N/A"},{"$error":"#N/A"},{"$error":"#N/A"},{"$error":"#N/A"},{"$error":"#N/A"},{"$error":"#N/A"},{"$error":"#N/A"},{"$error":"#N/A"}]
[null,null,null,null,null,null,null,null,null,null,null,356,0,0,0,0,0,{"$error":"#N/A"},{"$error":"#N/A"},{"$error":"#N/A"},{"$error":"#N/A"},{"$error":"#N/A"},{"$error":"#N/A"},{"$error":"#N/A"},{"$error":"#N/A"},{"$error":"#N/A"},{"$error":"#N/A"}]
[null,null,null,null,null,null,null,null,null,null,null,357,0,0,0,0,0,{"$error":"#N/A"},{"$error":"#N/A"},{"$error":"#N/A"},{"$error":"#N/A"},{"$error":"#N/A"},{"$error":"#N/A"},{"$error":"#N/A"},{"$error":"#N/A"},{"$error":"#N/A"},{"$error":"#N/A"}]
[null,null,null,null,null,null,null,null,null,null,null,358,0,0,0,0,0,{"$error":"#N/A"},{"$error":"#N/A"},{"$error":"#N/A"},{"$error":"#N/A"},{"$error":"#N/A"},{"$error":"#N/A"},{"$error":"#N/A"},{"$error":"#N/A"},{"$error":"#N/A"},{"$error":"#N/A"}]
[null,null,null,null,null,null,null,null,null,null,null,359,0,0,0,0,0,{"$error":"#N/A"},{"$error":"#N/A"},{"$error":"#N/A"},{"$error":"#N/A"},{"$error":"#N/A"},{"$error":"#N/A"},{"$error":"#N/A"},{"$error":"#N/A"},{"$error":"#N/A"},{"$error":"#N/A"}]
[null,null,null,null,null,null,null,null,null,null,null,360,0,0,0,0,0,{"$error":"#N/A"},{"$error":"#N/A"},{"$error":"#N/A"},{"$error":"#N/A"},{"$error":"#N/A"},{"$error":"#N/A"},{"$error":"#N/A"},{"$error":"#N/A"},{"$error":"#N/A"},{"$error":"#N/A"}]
[null,null,null,null,null,null,null,null,null,null,null,361,0,0,0,0,0,{"$error":"#N/A"},{"$error":"#N/A"},{"$error":"#N/A"},{"$error":"#N/A"},{"$error":"#N/A"},{"$error":"#N/A"},{"$error":"#N/A"},{"$error":"#N/A"},{"$error":"#N/A"},{"$error":"#N/A"}]
[null,null,null,null,null,null,null,null,null,null,null,362,0,0,0,0,0,{"$error":"#N/A"},{"$error":"#N/A"},{"$error":"#N/A"},{"$error":"#N/A"},{"$error":"#N/A"},{"$error":"#N/A"},{"$error":"#N/A"},{"$error":"#N/A"},{"$error":"#N/A"},{"$error":"#N/A"}]
[null,null,null,null,null,null,null,null,null,null,null,363,0,0,0,0,0,{"$error":"#N/A"},{"$error":"#N/A"},{"$error":"#N/A"},{"$error":"#N/A"},{"$error":"#N/A"},{"$error":"#N/A"},{"$error":"#N/A"},{"$error":"#N/A"},{"$error":"#N/A"},{"$error":"#N/A"}]
[null,null,null,null,null,null,null,null,null,null,null,364,0,0,0,0,0,{"$error":"#N/A"},{"$error":"#N/A"},{"$error":"#N/A"},{"$error":"#N/A"},{"$error":"#N/A"},{"$error":"#N/A"},{"$error":"#N/A"},{"$error":"#N/A"},{"$error":"#N/A"},{"$error":"#N/A"}]
[null,null,null,null,null,null,null,null,null,null,null,365,0,0,0,0,0,{"$error":"#N/A"},{"$error":"#N/A"},{"$error":"#N/A"},{"$error":"#N/A"},{"$error":"#N/A"},{"$error":"#N/A"},{"$error":"#N/A"},{"$error":"#N/A"},{"$error":"#N/A"},{"$error":"#N/A"}]
[null,null,null,null,null,null,null,null,null,null,null,366,{"$f":"IF(OR(kcjd<jdplant1,kcjd>jdplant1+C$22),0,kc.ini.1)","v":0},{"$f":"IF(OR(kcjd<jdplant1+C$22,kcjd>jdplant1+SUM(C$22,D$22)),0,+H$22+(kcjd-(jdplant1+C$22))/(jdplant1+SUM(C$22,D$22)-(jdplant1+C$22))*(I$22-H$22))","v":0},{"$f":"IF(OR(kcjd<jdplant1+SUM(C$22,D$22),kcjd>jdplant1+SUM(C$22,D$22,E$22)),0,kc.mid.1)","v":0},{"$f":"IF(OR(kcjd<jdplant1+SUM(C$22:E$22),kcjd>jdplant1+G$22),0,+I$22-(kcjd-(jdplant1+SUM(C$22:E$22)))/((jdplant1+G$22)-(jdplant1+SUM(C$22:E$22)))*(I$22-J$22))","v":0},{"$f":"MAX(M367:P367)","v":0},{"$f":"IF(OR(kcjd<jdplant2,kcjd>jdplant2+$C$23),0,kc.ini.2)","v":{"$error":"#N/A"}},{"$f":"IF(OR(kcjd<jdplant2+$C$23,kcjd>jdplant2+SUM($C$23,$D$23)),0,+kc.ini.2+(kcjd-(jdplant2+$C$23))/(jdplant2+SUM($C$23,$D$23)-(jdplant2+$C$23))*(kc.mid.2-kc.ini.2))","v":{"$error":"#N/A"}},{"$f":"IF(OR(kcjd<jdplant2+SUM($C$23,$D$23),kcjd>jdplant2+SUM($C$23,$D$23,$E$23)),0,kc.mid.2)","v":{"$error":"#N/A"}},{"$f":"IF(OR(kcjd<jdplant2+SUM($C$23:$E$23),kcjd>jdplant2+$G$23),0,+kc.mid.2-(kcjd-(jdplant2+SUM($C$23:$E$23)))/((jdplant2+$G$23)-(jdplant2+SUM($C$23:$E$23)))*(kc.mid.2-kc.late.2))","v":{"$error":"#N/A"}},{"$f":"MAX(R367:U367)","v":{"$error":"#N/A"}},{"$f":"IF(OR(kcjd<jdplant3,kcjd>jdplant3+$C$24),0,kc.ini.3)","v":{"$error":"#N/A"}},{"$f":"IF(OR(kcjd<jdplant3+$C$24,kcjd>jdplant3+SUM($C$24,$D$24)),0,+kc.ini.3+(kcjd-(jdplant3+$C$24))/(jdplant3+SUM($C$24,$D$24)-(jdplant3+$C$24))*(kc.mid.3-kc.ini.3))","v":{"$error":"#N/A"}},{"$f":"IF(OR(kcjd<jdplant3+SUM($C$24,$D$24),kcjd>jdplant3+SUM($C$24,$D$24,$E$24)),0,kc.mid.3)","v":{"$error":"#N/A"}},{"$f":"IF(OR(kcjd<jdplant3+SUM($C$24:$E$24),kcjd>jdplant3+$G$24),0,+kc.mid.3-(kcjd-(jdplant3+SUM($C$24:$E$24)))/((jdplant3+$G$24)-(jdplant3+SUM($C$24:$E$24)))*(kc.mid.3-kc.late.3))","v":{"$error":"#N/A"}},{"$f":"MAX(W367:Z367)","v":{"$error":"#N/A"}}]
[null,null,null,null,null,null,null,null,null,null,null,367,0,0,0,0,0,{"$error":"#N/A"},{"$error":"#N/A"},{"$error":"#N/A"},{"$error":"#N/A"},{"$error":"#N/A"},{"$error":"#N/A"},{"$error":"#N/A"},{"$error":"#N/A"},{"$error":"#N/A"},{"$error":"#N/A"}]
[null,null,null,null,null,null,null,null,null,null,null,368,0,0,0,0,0,{"$error":"#N/A"},{"$error":"#N/A"},{"$error":"#N/A"},{"$error":"#N/A"},{"$error":"#N/A"},{"$error":"#N/A"},{"$error":"#N/A"},{"$error":"#N/A"},{"$error":"#N/A"},{"$error":"#N/A"}]
[null,null,null,null,null,null,null,null,null,null,null,369,0,0,0,0,0,{"$error":"#N/A"},{"$error":"#N/A"},{"$error":"#N/A"},{"$error":"#N/A"},{"$error":"#N/A"},{"$error":"#N/A"},{"$error":"#N/A"},{"$error":"#N/A"},{"$error":"#N/A"},{"$error":"#N/A"}]
[null,null,null,null,null,null,null,null,null,null,null,370,0,0,0,0,0,{"$error":"#N/A"},{"$error":"#N/A"},{"$error":"#N/A"},{"$error":"#N/A"},{"$error":"#N/A"},{"$error":"#N/A"},{"$error":"#N/A"},{"$error":"#N/A"},{"$error":"#N/A"},{"$error":"#N/A"}]
[null,null,null,null,null,null,null,null,null,null,null,371,0,0,0,0,0,{"$error":"#N/A"},{"$error":"#N/A"},{"$error":"#N/A"},{"$error":"#N/A"},{"$error":"#N/A"},{"$error":"#N/A"},{"$error":"#N/A"},{"$error":"#N/A"},{"$error":"#N/A"},{"$error":"#N/A"}]
[null,null,null,null,null,null,null,null,null,null,null,372,0,0,0,0,0,{"$error":"#N/A"},{"$error":"#N/A"},{"$error":"#N/A"},{"$error":"#N/A"},{"$error":"#N/A"},{"$error":"#N/A"},{"$error":"#N/A"},{"$error":"#N/A"},{"$error":"#N/A"},{"$error":"#N/A"}]
[null,null,null,null,null,null,null,null,null,null,null,373,0,0,0,0,0,{"$error":"#N/A"},{"$error":"#N/A"},{"$error":"#N/A"},{"$error":"#N/A"},{"$error":"#N/A"},{"$error":"#N/A"},{"$error":"#N/A"},{"$error":"#N/A"},{"$error":"#N/A"},{"$error":"#N/A"}]
[null,null,null,null,null,null,null,null,null,null,null,374,0,0,0,0,0,{"$error":"#N/A"},{"$error":"#N/A"},{"$error":"#N/A"},{"$error":"#N/A"},{"$error":"#N/A"},{"$error":"#N/A"},{"$error":"#N/A"},{"$error":"#N/A"},{"$error":"#N/A"},{"$error":"#N/A"}]
[null,null,null,null,null,null,null,null,null,null,null,375,0,0,0,0,0,{"$error":"#N/A"},{"$error":"#N/A"},{"$error":"#N/A"},{"$error":"#N/A"},{"$error":"#N/A"},{"$error":"#N/A"},{"$error":"#N/A"},{"$error":"#N/A"},{"$error":"#N/A"},{"$error":"#N/A"}]
[null,null,null,null,null,null,null,null,null,null,null,376,0,0,0,0,0,{"$error":"#N/A"},{"$error":"#N/A"},{"$error":"#N/A"},{"$error":"#N/A"},{"$error":"#N/A"},{"$error":"#N/A"},{"$error":"#N/A"},{"$error":"#N/A"},{"$error":"#N/A"},{"$error":"#N/A"}]
[null,null,null,null,null,null,null,null,null,null,null,377,0,0,0,0,0,{"$error":"#N/A"},{"$error":"#N/A"},{"$error":"#N/A"},{"$error":"#N/A"},{"$error":"#N/A"},{"$error":"#N/A"},{"$error":"#N/A"},{"$error":"#N/A"},{"$error":"#N/A"},{"$error":"#N/A"}]
[null,null,null,null,null,null,null,null,null,null,null,378,0,0,0,0,0,{"$error":"#N/A"},{"$error":"#N/A"},{"$error":"#N/A"},{"$error":"#N/A"},{"$error":"#N/A"},{"$error":"#N/A"},{"$error":"#N/A"},{"$error":"#N/A"},{"$error":"#N/A"},{"$error":"#N/A"}]
[null,null,null,null,null,null,null,null,null,null,null,379,0,0,0,0,0,{"$error":"#N/A"},{"$error":"#N/A"},{"$error":"#N/A"},{"$error":"#N/A"},{"$error":"#N/A"},{"$error":"#N/A"},{"$error":"#N/A"},{"$error":"#N/A"},{"$error":"#N/A"},{"$error":"#N/A"}]
[null,null,null,null,null,null,null,null,null,null,null,380,0,0,0,0,0,{"$error":"#N/A"},{"$error":"#N/A"},{"$error":"#N/A"},{"$error":"#N/A"},{"$error":"#N/A"},{"$error":"#N/A"},{"$error":"#N/A"},{"$error":"#N/A"},{"$error":"#N/A"},{"$error":"#N/A"}]
[null,null,null,null,null,null,null,null,null,null,null,381,0,0,0,0,0,{"$error":"#N/A"},{"$error":"#N/A"},{"$error":"#N/A"},{"$error":"#N/A"},{"$error":"#N/A"},{"$error":"#N/A"},{"$error":"#N/A"},{"$error":"#N/A"},{"$error":"#N/A"},{"$error":"#N/A"}]
[null,null,null,null,null,null,null,null,null,null,null,382,0,0,0,0,0,{"$error":"#N/A"},{"$error":"#N/A"},{"$error":"#N/A"},{"$error":"#N/A"},{"$error":"#N/A"},{"$error":"#N/A"},{"$error":"#N/A"},{"$error":"#N/A"},{"$error":"#N/A"},{"$error":"#N/A"}]
[null,null,null,null,null,null,null,null,null,null,null,383,0,0,0,0,0,{"$error":"#N/A"},{"$error":"#N/A"},{"$error":"#N/A"},{"$error":"#N/A"},{"$error":"#N/A"},{"$error":"#N/A"},{"$error":"#N/A"},{"$error":"#N/A"},{"$error":"#N/A"},{"$error":"#N/A"}]
[null,null,null,null,null,null,null,null,null,null,null,384,0,0,0,0,0,{"$error":"#N/A"},{"$error":"#N/A"},{"$error":"#N/A"},{"$error":"#N/A"},{"$error":"#N/A"},{"$error":"#N/A"},{"$error":"#N/A"},{"$error":"#N/A"},{"$error":"#N/A"},{"$error":"#N/A"}]
[null,null,null,null,null,null,null,null,null,null,null,385,0,0,0,0,0,{"$error":"#N/A"},{"$error":"#N/A"},{"$error":"#N/A"},{"$error":"#N/A"},{"$error":"#N/A"},{"$error":"#N/A"},{"$error":"#N/A"},{"$error":"#N/A"},{"$error":"#N/A"},{"$error":"#N/A"}]
[null,null,null,null,null,null,null,null,null,null,null,386,0,0,0,0,0,{"$error":"#N/A"},{"$error":"#N/A"},{"$error":"#N/A"},{"$error":"#N/A"},{"$error":"#N/A"},{"$error":"#N/A"},{"$error":"#N/A"},{"$error":"#N/A"},{"$error":"#N/A"},{"$error":"#N/A"}]
[null,null,null,null,null,null,null,null,null,null,null,387,0,0,0,0,0,{"$error":"#N/A"},{"$error":"#N/A"},{"$error":"#N/A"},{"$error":"#N/A"},{"$error":"#N/A"},{"$error":"#N/A"},{"$error":"#N/A"},{"$error":"#N/A"},{"$error":"#N/A"},{"$error":"#N/A"}]
[null,null,null,null,null,null,null,null,null,null,null,388,0,0,0,0,0,{"$error":"#N/A"},{"$error":"#N/A"},{"$error":"#N/A"},{"$error":"#N/A"},{"$error":"#N/A"},{"$error":"#N/A"},{"$error":"#N/A"},{"$error":"#N/A"},{"$error":"#N/A"},{"$error":"#N/A"}]
[null,null,null,null,null,null,null,null,null,null,null,389,0,0,0,0,0,{"$error":"#N/A"},{"$error":"#N/A"},{"$error":"#N/A"},{"$error":"#N/A"},{"$error":"#N/A"},{"$error":"#N/A"},{"$error":"#N/A"},{"$error":"#N/A"},{"$error":"#N/A"},{"$error":"#N/A"}]
[null,null,null,null,null,null,null,null,null,null,null,390,0,0,0,0,0,{"$error":"#N/A"},{"$error":"#N/A"},{"$error":"#N/A"},{"$error":"#N/A"},{"$error":"#N/A"},{"$error":"#N/A"},{"$error":"#N/A"},{"$error":"#N/A"},{"$error":"#N/A"},{"$error":"#N/A"}]
[null,null,null,null,null,null,null,null,null,null,null,391,0,0,0,0,0,{"$error":"#N/A"},{"$error":"#N/A"},{"$error":"#N/A"},{"$error":"#N/A"},{"$error":"#N/A"},{"$error":"#N/A"},{"$error":"#N/A"},{"$error":"#N/A"},{"$error":"#N/A"},{"$error":"#N/A"}]
[null,null,null,null,null,null,null,null,null,null,null,392,0,0,0,0,0,{"$error":"#N/A"},{"$error":"#N/A"},{"$error":"#N/A"},{"$error":"#N/A"},{"$error":"#N/A"},{"$error":"#N/A"},{"$error":"#N/A"},{"$error":"#N/A"},{"$error":"#N/A"},{"$error":"#N/A"}]
[null,null,null,null,null,null,null,null,null,null,null,393,0,0,0,0,0,{"$error":"#N/A"},{"$error":"#N/A"},{"$error":"#N/A"},{"$error":"#N/A"},{"$error":"#N/A"},{"$error":"#N/A"},{"$error":"#N/A"},{"$error":"#N/A"},{"$error":"#N/A"},{"$error":"#N/A"}]
[null,null,null,null,null,null,null,null,null,null,null,394,0,0,0,0,0,{"$error":"#N/A"},{"$error":"#N/A"},{"$error":"#N/A"},{"$error":"#N/A"},{"$error":"#N/A"},{"$error":"#N/A"},{"$error":"#N/A"},{"$error":"#N/A"},{"$error":"#N/A"},{"$error":"#N/A"}]
[null,null,null,null,null,null,null,null,null,null,null,395,0,0,0,0,0,{"$error":"#N/A"},{"$error":"#N/A"},{"$error":"#N/A"},{"$error":"#N/A"},{"$error":"#N/A"},{"$error":"#N/A"},{"$error":"#N/A"},{"$error":"#N/A"},{"$error":"#N/A"},{"$error":"#N/A"}]
[null,null,null,null,null,null,null,null,null,null,null,396,0,0,0,0,0,{"$error":"#N/A"},{"$error":"#N/A"},{"$error":"#N/A"},{"$error":"#N/A"},{"$error":"#N/A"},{"$error":"#N/A"},{"$error":"#N/A"},{"$error":"#N/A"},{"$error":"#N/A"},{"$error":"#N/A"}]
[null,null,null,null,null,null,null,null,null,null,null,397,0,0,0,0,0,{"$error":"#N/A"},{"$error":"#N/A"},{"$error":"#N/A"},{"$error":"#N/A"},{"$error":"#N/A"},{"$error":"#N/A"},{"$error":"#N/A"},{"$error":"#N/A"},{"$error":"#N/A"},{"$error":"#N/A"}]
[null,null,null,null,null,null,null,null,null,null,null,398,{"$f":"IF(OR(kcjd<jdplant1,kcjd>jdplant1+C$22),0,kc.ini.1)","v":0},{"$f":"IF(OR(kcjd<jdplant1+C$22,kcjd>jdplant1+SUM(C$22,D$22)),0,+H$22+(kcjd-(jdplant1+C$22))/(jdplant1+SUM(C$22,D$22)-(jdplant1+C$22))*(I$22-H$22))","v":0},{"$f":"IF(OR(kcjd<jdplant1+SUM(C$22,D$22),kcjd>jdplant1+SUM(C$22,D$22,E$22)),0,kc.mid.1)","v":0},{"$f":"IF(OR(kcjd<jdplant1+SUM(C$22:E$22),kcjd>jdplant1+G$22),0,+I$22-(kcjd-(jdplant1+SUM(C$22:E$22)))/((jdplant1+G$22)-(jdplant1+SUM(C$22:E$22)))*(I$22-J$22))","v":0},0,{"$f":"IF(OR(kcjd<jdplant2,kcjd>jdplant2+$C$23),0,kc.ini.2)","v":{"$error":"#N/A"}},{"$f":"IF(OR(kcjd<jdplant2+$C$23,kcjd>jdplant2+SUM($C$23,$D$23)),0,+kc.ini.2+(kcjd-(jdplant2+$C$23))/(jdplant2+SUM($C$23,$D$23)-(jdplant2+$C$23))*(kc.mid.2-kc.ini.2))","v":{"$error":"#N/A"}},{"$f":"IF(OR(kcjd<jdplant2+SUM($C$23,$D$23),kcjd>jdplant2+SUM($C$23,$D$23,$E$23)),0,kc.mid.2)","v":{"$error":"#N/A"}},{"$f":"IF(OR(kcjd<jdplant2+SUM($C$23:$E$23),kcjd>jdplant2+$G$23),0,+kc.mid.2-(kcjd-(jdplant2+SUM($C$23:$E$23)))/((jdplant2+$G$23)-(jdplant2+SUM($C$23:$E$23)))*(kc.mid.2-kc.late.2))","v":{"$error":"#N/A"}},{"$error":"#N/A"},{"$f":"IF(OR(kcjd<jdplant3,kcjd>jdplant3+$C$24),0,kc.ini.3)","v":{"$error":"#N/A"}},{"$f":"IF(OR(kcjd<jdplant3+$C$24,kcjd>jdplant3+SUM($C$24,$D$24)),0,+kc.ini.3+(kcjd-(jdplant3+$C$24))/(jdplant3+SUM($C$24,$D$24)-(jdplant3+$C$24))*(kc.mid.3-kc.ini.3))","v":{"$error":"#N/A"}},{"$f":"IF(OR(kcjd<jdplant3+SUM($C$24,$D$24),kcjd>jdplant3+SUM($C$24,$D$24,$E$24)),0,kc.mid.3)","v":{"$error":"#N/A"}},{"$f":"IF(OR(kcjd<jdplant3+SUM($C$24:$E$24),kcjd>jdplant3+$G$24),0,+kc.mid.3-(kcjd-(jdplant3+SUM($C$24:$E$24)))/((jdplant3+$G$24)-(jdplant3+SUM($C$24:$E$24)))*(kc.mid.3-kc.late.3))","v":{"$error":"#N/A"}},{"$error":"#N/A"}]
[null,null,null,null,null,null,null,null,null,null,null,399,0,0,0,0,0,{"$error":"#N/A"},{"$error":"#N/A"},{"$error":"#N/A"},{"$error":"#N/A"},{"$error":"#N/A"},{"$error":"#N/A"},{"$error":"#N/A"},{"$error":"#N/A"},{"$error":"#N/A"},{"$error":"#N/A"}]
[null,null,null,null,null,null,null,null,null,null,null,400,0,0,0,0,0,{"$error":"#N/A"},{"$error":"#N/A"},{"$error":"#N/A"},{"$error":"#N/A"},{"$error":"#N/A"},{"$error":"#N/A"},{"$error":"#N/A"},{"$error":"#N/A"},{"$error":"#N/A"},{"$error":"#N/A"}]
[null,null,null,null,null,null,null,null,null,null,null,401,0,0,0,0,0,{"$error":"#N/A"},{"$error":"#N/A"},{"$error":"#N/A"},{"$error":"#N/A"},{"$error":"#N/A"},{"$error":"#N/A"},{"$error":"#N/A"},{"$error":"#N/A"},{"$error":"#N/A"},{"$error":"#N/A"}]
[null,null,null,null,null,null,null,null,null,null,null,402,0,0,0,0,0,{"$error":"#N/A"},{"$error":"#N/A"},{"$error":"#N/A"},{"$error":"#N/A"},{"$error":"#N/A"},{"$error":"#N/A"},{"$error":"#N/A"},{"$error":"#N/A"},{"$error":"#N/A"},{"$error":"#N/A"}]
[null,null,null,null,null,null,null,null,null,null,null,403,0,0,0,0,0,{"$error":"#N/A"},{"$error":"#N/A"},{"$error":"#N/A"},{"$error":"#N/A"},{"$error":"#N/A"},{"$error":"#N/A"},{"$error":"#N/A"},{"$error":"#N/A"},{"$error":"#N/A"},{"$error":"#N/A"}]
[null,null,null,null,null,null,null,null,null,null,null,404,0,0,0,0,0,{"$error":"#N/A"},{"$error":"#N/A"},{"$error":"#N/A"},{"$error":"#N/A"},{"$error":"#N/A"},{"$error":"#N/A"},{"$error":"#N/A"},{"$error":"#N/A"},{"$error":"#N/A"},{"$error":"#N/A"}]
[null,null,null,null,null,null,null,null,null,null,null,405,0,0,0,0,0,{"$error":"#N/A"},{"$error":"#N/A"},{"$error":"#N/A"},{"$error":"#N/A"},{"$error":"#N/A"},{"$error":"#N/A"},{"$error":"#N/A"},{"$error":"#N/A"},{"$error":"#N/A"},{"$error":"#N/A"}]
[null,null,null,null,null,null,null,null,null,null,null,406,0,0,0,0,0,{"$error":"#N/A"},{"$error":"#N/A"},{"$error":"#N/A"},{"$error":"#N/A"},{"$error":"#N/A"},{"$error":"#N/A"},{"$error":"#N/A"},{"$error":"#N/A"},{"$error":"#N/A"},{"$error":"#N/A"}]
[null,null,null,null,null,null,null,null,null,null,null,407,0,0,0,0,0,{"$error":"#N/A"},{"$error":"#N/A"},{"$error":"#N/A"},{"$error":"#N/A"},{"$error":"#N/A"},{"$error":"#N/A"},{"$error":"#N/A"},{"$error":"#N/A"},{"$error":"#N/A"},{"$error":"#N/A"}]
[null,null,null,null,null,null,null,null,null,null,null,408,0,0,0,0,0,{"$error":"#N/A"},{"$error":"#N/A"},{"$error":"#N/A"},{"$error":"#N/A"},{"$error":"#N/A"},{"$error":"#N/A"},{"$error":"#N/A"},{"$error":"#N/A"},{"$error":"#N/A"},{"$error":"#N/A"}]
[null,null,null,null,null,null,null,null,null,null,null,409,0,0,0,0,0,{"$error":"#N/A"},{"$error":"#N/A"},{"$error":"#N/A"},{"$error":"#N/A"},{"$error":"#N/A"},{"$error":"#N/A"},{"$error":"#N/A"},{"$error":"#N/A"},{"$error":"#N/A"},{"$error":"#N/A"}]
[null,null,null,null,null,null,null,null,null,null,null,410,0,0,0,0,0,{"$error":"#N/A"},{"$error":"#N/A"},{"$error":"#N/A"},{"$error":"#N/A"},{"$error":"#N/A"},{"$error":"#N/A"},{"$error":"#N/A"},{"$error":"#N/A"},{"$error":"#N/A"},{"$error":"#N/A"}]
[null,null,null,null,null,null,null,null,null,null,null,411,0,0,0,0,0,{"$error":"#N/A"},{"$error":"#N/A"},{"$error":"#N/A"},{"$error":"#N/A"},{"$error":"#N/A"},{"$error":"#N/A"},{"$error":"#N/A"},{"$error":"#N/A"},{"$error":"#N/A"},{"$error":"#N/A"}]
[null,null,null,null,null,null,null,null,null,null,null,412,0,0,0,0,0,{"$error":"#N/A"},{"$error":"#N/A"},{"$error":"#N/A"},{"$error":"#N/A"},{"$error":"#N/A"},{"$error":"#N/A"},{"$error":"#N/A"},{"$error":"#N/A"},{"$error":"#N/A"},{"$error":"#N/A"}]
[null,null,null,null,null,null,null,null,null,null,null,413,0,0,0,0,0,{"$error":"#N/A"},{"$error":"#N/A"},{"$error":"#N/A"},{"$error":"#N/A"},{"$error":"#N/A"},{"$error":"#N/A"},{"$error":"#N/A"},{"$error":"#N/A"},{"$error":"#N/A"},{"$error":"#N/A"}]
[null,null,null,null,null,null,null,null,null,null,null,414,0,0,0,0,0,{"$error":"#N/A"},{"$error":"#N/A"},{"$error":"#N/A"},{"$error":"#N/A"},{"$error":"#N/A"},{"$error":"#N/A"},{"$error":"#N/A"},{"$error":"#N/A"},{"$error":"#N/A"},{"$error":"#N/A"}]
[null,null,null,null,null,null,null,null,null,null,null,415,0,0,0,0,0,{"$error":"#N/A"},{"$error":"#N/A"},{"$error":"#N/A"},{"$error":"#N/A"},{"$error":"#N/A"},{"$error":"#N/A"},{"$error":"#N/A"},{"$error":"#N/A"},{"$error":"#N/A"},{"$error":"#N/A"}]
[null,null,null,null,null,null,null,null,null,null,null,416,0,0,0,0,0,{"$error":"#N/A"},{"$error":"#N/A"},{"$error":"#N/A"},{"$error":"#N/A"},{"$error":"#N/A"},{"$error":"#N/A"},{"$error":"#N/A"},{"$error":"#N/A"},{"$error":"#N/A"},{"$error":"#N/A"}]
[null,null,null,null,null,null,null,null,null,null,null,417,0,0,0,0,0,{"$error":"#N/A"},{"$error":"#N/A"},{"$error":"#N/A"},{"$error":"#N/A"},{"$error":"#N/A"},{"$error":"#N/A"},{"$error":"#N/A"},{"$error":"#N/A"},{"$error":"#N/A"},{"$error":"#N/A"}]
[null,null,null,null,null,null,null,null,null,null,null,418,0,0,0,0,0,{"$error":"#N/A"},{"$error":"#N/A"},{"$error":"#N/A"},{"$error":"#N/A"},{"$error":"#N/A"},{"$error":"#N/A"},{"$error":"#N/A"},{"$error":"#N/A"},{"$error":"#N/A"},{"$error":"#N/A"}]
[null,null,null,null,null,null,null,null,null,null,null,419,0,0,0,0,0,{"$error":"#N/A"},{"$error":"#N/A"},{"$error":"#N/A"},{"$error":"#N/A"},{"$error":"#N/A"},{"$error":"#N/A"},{"$error":"#N/A"},{"$error":"#N/A"},{"$error":"#N/A"},{"$error":"#N/A"}]
[null,null,null,null,null,null,null,null,null,null,null,420,0,0,0,0,0,{"$error":"#N/A"},{"$error":"#N/A"},{"$error":"#N/A"},{"$error":"#N/A"},{"$error":"#N/A"},{"$error":"#N/A"},{"$error":"#N/A"},{"$error":"#N/A"},{"$error":"#N/A"},{"$error":"#N/A"}]
[null,null,null,null,null,null,null,null,null,null,null,421,0,0,0,0,0,{"$error":"#N/A"},{"$error":"#N/A"},{"$error":"#N/A"},{"$error":"#N/A"},{"$error":"#N/A"},{"$error":"#N/A"},{"$error":"#N/A"},{"$error":"#N/A"},{"$error":"#N/A"},{"$error":"#N/A"}]
[null,null,null,null,null,null,null,null,null,null,null,422,0,0,0,0,0,{"$error":"#N/A"},{"$error":"#N/A"},{"$error":"#N/A"},{"$error":"#N/A"},{"$error":"#N/A"},{"$error":"#N/A"},{"$error":"#N/A"},{"$error":"#N/A"},{"$error":"#N/A"},{"$error":"#N/A"}]
[null,null,null,null,null,null,null,null,null,null,null,423,0,0,0,0,0,{"$error":"#N/A"},{"$error":"#N/A"},{"$error":"#N/A"},{"$error":"#N/A"},{"$error":"#N/A"},{"$error":"#N/A"},{"$error":"#N/A"},{"$error":"#N/A"},{"$error":"#N/A"},{"$error":"#N/A"}]
[null,null,null,null,null,null,null,null,null,null,null,424,0,0,0,0,0,{"$error":"#N/A"},{"$error":"#N/A"},{"$error":"#N/A"},{"$error":"#N/A"},{"$error":"#N/A"},{"$error":"#N/A"},{"$error":"#N/A"},{"$error":"#N/A"},{"$error":"#N/A"},{"$error":"#N/A"}]
[null,null,null,null,null,null,null,null,null,null,null,425,0,0,0,0,0,{"$error":"#N/A"},{"$error":"#N/A"},{"$error":"#N/A"},{"$error":"#N/A"},{"$error":"#N/A"},{"$error":"#N/A"},{"$error":"#N/A"},{"$error":"#N/A"},{"$error":"#N/A"},{"$error":"#N/A"}]
[null,null,null,null,null,null,null,null,null,null,null,426,0,0,0,0,0,{"$error":"#N/A"},{"$error":"#N/A"},{"$error":"#N/A"},{"$error":"#N/A"},{"$error":"#N/A"},{"$error":"#N/A"},{"$error":"#N/A"},{"$error":"#N/A"},{"$error":"#N/A"},{"$error":"#N/A"}]
[null,null,null,null,null,null,null,null,null,null,null,427,0,0,0,0,0,{"$error":"#N/A"},{"$error":"#N/A"},{"$error":"#N/A"},{"$error":"#N/A"},{"$error":"#N/A"},{"$error":"#N/A"},{"$error":"#N/A"},{"$error":"#N/A"},{"$error":"#N/A"},{"$error":"#N/A"}]
[null,null,null,null,null,null,null,null,null,null,null,428,0,0,0,0,0,{"$error":"#N/A"},{"$error":"#N/A"},{"$error":"#N/A"},{"$error":"#N/A"},{"$error":"#N/A"},{"$error":"#N/A"},{"$error":"#N/A"},{"$error":"#N/A"},{"$error":"#N/A"},{"$error":"#N/A"}]
[null,null,null,null,null,null,null,null,null,null,null,429,0,0,0,0,0,{"$error":"#N/A"},{"$error":"#N/A"},{"$error":"#N/A"},{"$error":"#N/A"},{"$error":"#N/A"},{"$error":"#N/A"},{"$error":"#N/A"},{"$error":"#N/A"},{"$error":"#N/A"},{"$error":"#N/A"}]
[null,null,null,null,null,null,null,null,null,null,null,430,{"$f":"IF(OR(kcjd<jdplant1,kcjd>jdplant1+C$22),0,kc.ini.1)","v":0},{"$f":"IF(OR(kcjd<jdplant1+C$22,kcjd>jdplant1+SUM(C$22,D$22)),0,+H$22+(kcjd-(jdplant1+C$22))/(jdplant1+SUM(C$22,D$22)-(jdplant1+C$22))*(I$22-H$22))","v":0},{"$f":"IF(OR(kcjd<jdplant1+SUM(C$22,D$22),kcjd>jdplant1+SUM(C$22,D$22,E$22)),0,kc.mid.1)","v":0},{"$f":"IF(OR(kcjd<jdplant1+SUM(C$22:E$22),kcjd>jdplant1+G$22),0,+I$22-(kcjd-(jdplant1+SUM(C$22:E$22)))/((jdplant1+G$22)-(jdplant1+SUM(C$22:E$22)))*(I$22-J$22))","v":0},{"$f":"MAX(M431:P431)","v":0},{"$f":"IF(OR(kcjd<jdplant2,kcjd>jdplant2+$C$23),0,kc.ini.2)","v":{"$error":"#N/A"}},{"$f":"IF(OR(kcjd<jdplant2+$C$23,kcjd>jdplant2+SUM($C$23,$D$23)),0,+kc.ini.2+(kcjd-(jdplant2+$C$23))/(jdplant2+SUM($C$23,$D$23)-(jdplant2+$C$23))*(kc.mid.2-kc.ini.2))","v":{"$error":"#N/A"}},{"$f":"IF(OR(kcjd<jdplant2+SUM($C$23,$D$23),kcjd>jdplant2+SUM($C$23,$D$23,$E$23)),0,kc.mid.2)","v":{"$error":"#N/A"}},{"$f":"IF(OR(kcjd<jdplant2+SUM($C$23:$E$23),kcjd>jdplant2+$G$23),0,+kc.mid.2-(kcjd-(jdplant2+SUM($C$23:$E$23)))/((jdplant2+$G$23)-(jdplant2+SUM($C$23:$E$23)))*(kc.mid.2-kc.late.2))","v":{"$error":"#N/A"}},{"$f":"MAX(R431:U431)","v":{"$error":"#N/A"}},{"$f":"IF(OR(kcjd<jdplant3,kcjd>jdplant3+$C$24),0,kc.ini.3)","v":{"$error":"#N/A"}},{"$f":"IF(OR(kcjd<jdplant3+$C$24,kcjd>jdplant3+SUM($C$24,$D$24)),0,+kc.ini.3+(kcjd-(jdplant3+$C$24))/(jdplant3+SUM($C$24,$D$24)-(jdplant3+$C$24))*(kc.mid.3-kc.ini.3))","v":{"$error":"#N/A"}},{"$f":"IF(OR(kcjd<jdplant3+SUM($C$24,$D$24),kcjd>jdplant3+SUM($C$24,$D$24,$E$24)),0,kc.mid.3)","v":{"$error":"#N/A"}},{"$f":"IF(OR(kcjd<jdplant3+SUM($C$24:$E$24),kcjd>jdplant3+$G$24),0,+kc.mid.3-(kcjd-(jdplant3+SUM($C$24:$E$24)))/((jdplant3+$G$24)-(jdplant3+SUM($C$24:$E$24)))*(kc.mid.3-kc.late.3))","v":{"$error":"#N/A"}},{"$f":"MAX(W431:Z431)","v":{"$error":"#N/A"}}]
[null,null,null,null,null,null,null,null,null,null,null,431,0,0,0,0,0,{"$error":"#N/A"},{"$error":"#N/A"},{"$error":"#N/A"},{"$error":"#N/A"},{"$error":"#N/A"},{"$error":"#N/A"},{"$error":"#N/A"},{"$error":"#N/A"},{"$error":"#N/A"},{"$error":"#N/A"}]
[null,null,null,null,null,null,null,null,null,null,null,432,0,0,0,0,0,{"$error":"#N/A"},{"$error":"#N/A"},{"$error":"#N/A"},{"$error":"#N/A"},{"$error":"#N/A"},{"$error":"#N/A"},{"$error":"#N/A"},{"$error":"#N/A"},{"$error":"#N/A"},{"$error":"#N/A"}]
[null,null,null,null,null,null,null,null,null,null,null,433,0,0,0,0,0,{"$error":"#N/A"},{"$error":"#N/A"},{"$error":"#N/A"},{"$error":"#N/A"},{"$error":"#N/A"},{"$error":"#N/A"},{"$error":"#N/A"},{"$error":"#N/A"},{"$error":"#N/A"},{"$error":"#N/A"}]
[null,null,null,null,null,null,null,null,null,null,null,434,0,0,0,0,0,{"$error":"#N/A"},{"$error":"#N/A"},{"$error":"#N/A"},{"$error":"#N/A"},{"$error":"#N/A"},{"$error":"#N/A"},{"$error":"#N/A"},{"$error":"#N/A"},{"$error":"#N/A"},{"$error":"#N/A"}]
[null,null,null,null,null,null,null,null,null,null,null,435,0,0,0,0,0,{"$error":"#N/A"},{"$error":"#N/A"},{"$error":"#N/A"},{"$error":"#N/A"},{"$error":"#N/A"},{"$error":"#N/A"},{"$error":"#N/A"},{"$error":"#N/A"},{"$error":"#N/A"},{"$error":"#N/A"}]
[null,null,null,null,null,null,null,null,null,null,null,436,0,0,0,0,0,{"$error":"#N/A"},{"$error":"#N/A"},{"$error":"#N/A"},{"$error":"#N/A"},{"$error":"#N/A"},{"$error":"#N/A"},{"$error":"#N/A"},{"$error":"#N/A"},{"$error":"#N/A"},{"$error":"#N/A"}]
[null,null,null,null,null,null,null,null,null,null,null,437,0,0,0,0,0,{"$error":"#N/A"},{"$error":"#N/A"},{"$error":"#N/A"},{"$error":"#N/A"},{"$error":"#N/A"},{"$error":"#N/A"},{"$error":"#N/A"},{"$error":"#N/A"},{"$error":"#N/A"},{"$error":"#N/A"}]
[null,null,null,null,null,null,null,null,null,null,null,438,0,0,0,0,0,{"$error":"#N/A"},{"$error":"#N/A"},{"$error":"#N/A"},{"$error":"#N/A"},{"$error":"#N/A"},{"$error":"#N/A"},{"$error":"#N/A"},{"$error":"#N/A"},{"$error":"#N/A"},{"$error":"#N/A"}]
[null,null,null,null,null,null,null,null,null,null,null,439,0,0,0,0,0,{"$error":"#N/A"},{"$error":"#N/A"},{"$error":"#N/A"},{"$error":"#N/A"},{"$error":"#N/A"},{"$error":"#N/A"},{"$error":"#N/A"},{"$error":"#N/A"},{"$error":"#N/A"},{"$error":"#N/A"}]
[null,null,null,null,null,null,null,null,null,null,null,440,0,0,0,0,0,{"$error":"#N/A"},{"$error":"#N/A"},{"$error":"#N/A"},{"$error":"#N/A"},{"$error":"#N/A"},{"$error":"#N/A"},{"$error":"#N/A"},{"$error":"#N/A"},{"$error":"#N/A"},{"$error":"#N/A"}]
[null,null,null,null,null,null,null,null,null,null,null,441,0,0,0,0,0,{"$error":"#N/A"},{"$error":"#N/A"},{"$error":"#N/A"},{"$error":"#N/A"},{"$error":"#N/A"},{"$error":"#N/A"},{"$error":"#N/A"},{"$error":"#N/A"},{"$error":"#N/A"},{"$error":"#N/A"}]
[null,null,null,null,null,null,null,null,null,null,null,442,0,0,0,0,0,{"$error":"#N/A"},{"$error":"#N/A"},{"$error":"#N/A"},{"$error":"#N/A"},{"$error":"#N/A"},{"$error":"#N/A"},{"$error":"#N/A"},{"$error":"#N/A"},{"$error":"#N/A"},{"$error":"#N/A"}]
[null,null,null,null,null,null,null,null,null,null,null,443,0,0,0,0,0,{"$error":"#N/A"},{"$error":"#N/A"},{"$error":"#N/A"},{"$error":"#N/A"},{"$error":"#N/A"},{"$error":"#N/A"},{"$error":"#N/A"},{"$error":"#N/A"},{"$error":"#N/A"},{"$error":"#N/A"}]
[null,null,null,null,null,null,null,null,null,null,null,444,0,0,0,0,0,{"$error":"#N/A"},{"$error":"#N/A"},{"$error":"#N/A"},{"$error":"#N/A"},{"$error":"#N/A"},{"$error":"#N/A"},{"$error":"#N/A"},{"$error":"#N/A"},{"$error":"#N/A"},{"$error":"#N/A"}]
[null,null,null,null,null,null,null,null,null,null,null,445,0,0,0,0,0,{"$error":"#N/A"},{"$error":"#N/A"},{"$error":"#N/A"},{"$error":"#N/A"},{"$error":"#N/A"},{"$error":"#N/A"},{"$error":"#N/A"},{"$error":"#N/A"},{"$error":"#N/A"},{"$error":"#N/A"}]
[null,null,null,null,null,null,null,null,null,null,null,446,0,0,0,0,0,{"$error":"#N/A"},{"$error":"#N/A"},{"$error":"#N/A"},{"$error":"#N/A"},{"$error":"#N/A"},{"$error":"#N/A"},{"$error":"#N/A"},{"$error":"#N/A"},{"$error":"#N/A"},{"$error":"#N/A"}]
[null,null,null,null,null,null,null,null,null,null,null,447,0,0,0,0,0,{"$error":"#N/A"},{"$error":"#N/A"},{"$error":"#N/A"},{"$error":"#N/A"},{"$error":"#N/A"},{"$error":"#N/A"},{"$error":"#N/A"},{"$error":"#N/A"},{"$error":"#N/A"},{"$error":"#N/A"}]
[null,null,null,null,null,null,null,null,null,null,null,448,0,0,0,0,0,{"$error":"#N/A"},{"$error":"#N/A"},{"$error":"#N/A"},{"$error":"#N/A"},{"$error":"#N/A"},{"$error":"#N/A"},{"$error":"#N/A"},{"$error":"#N/A"},{"$error":"#N/A"},{"$error":"#N/A"}]
[null,null,null,null,null,null,null,null,null,null,null,449,0,0,0,0,0,{"$error":"#N/A"},{"$error":"#N/A"},{"$error":"#N/A"},{"$error":"#N/A"},{"$error":"#N/A"},{"$error":"#N/A"},{"$error":"#N/A"},{"$error":"#N/A"},{"$error":"#N/A"},{"$error":"#N/A"}]
[null,null,null,null,null,null,null,null,null,null,null,450,0,0,0,0,0,{"$error":"#N/A"},{"$error":"#N/A"},{"$error":"#N/A"},{"$error":"#N/A"},{"$error":"#N/A"},{"$error":"#N/A"},{"$error":"#N/A"},{"$error":"#N/A"},{"$error":"#N/A"},{"$error":"#N/A"}]
[null,null,null,null,null,null,null,null,null,null,null,451,0,0,0,0,0,{"$error":"#N/A"},{"$error":"#N/A"},{"$error":"#N/A"},{"$error":"#N/A"},{"$error":"#N/A"},{"$error":"#N/A"},{"$error":"#N/A"},{"$error":"#N/A"},{"$error":"#N/A"},{"$error":"#N/A"}]
[null,null,null,null,null,null,null,null,null,null,null,452,0,0,0,0,0,{"$error":"#N/A"},{"$error":"#N/A"},{"$error":"#N/A"},{"$error":"#N/A"},{"$error":"#N/A"},{"$error":"#N/A"},{"$error":"#N/A"},{"$error":"#N/A"},{"$error":"#N/A"},{"$error":"#N/A"}]
[null,null,null,null,null,null,null,null,null,null,null,453,0,0,0,0,0,{"$error":"#N/A"},{"$error":"#N/A"},{"$error":"#N/A"},{"$error":"#N/A"},{"$error":"#N/A"},{"$error":"#N/A"},{"$error":"#N/A"},{"$error":"#N/A"},{"$error":"#N/A"},{"$error":"#N/A"}]
[null,null,null,null,null,null,null,null,null,null,null,454,0,0,0,0,0,{"$error":"#N/A"},{"$error":"#N/A"},{"$error":"#N/A"},{"$error":"#N/A"},{"$error":"#N/A"},{"$error":"#N/A"},{"$error":"#N/A"},{"$error":"#N/A"},{"$error":"#N/A"},{"$error":"#N/A"}]
[null,null,null,null,null,null,null,null,null,null,null,455,0,0,0,0,0,{"$error":"#N/A"},{"$error":"#N/A"},{"$error":"#N/A"},{"$error":"#N/A"},{"$error":"#N/A"},{"$error":"#N/A"},{"$error":"#N/A"},{"$error":"#N/A"},{"$error":"#N/A"},{"$error":"#N/A"}]
[null,null,null,null,null,null,null,null,null,null,null,456,0,0,0,0,0,{"$error":"#N/A"},{"$error":"#N/A"},{"$error":"#N/A"},{"$error":"#N/A"},{"$error":"#N/A"},{"$error":"#N/A"},{"$error":"#N/A"},{"$error":"#N/A"},{"$error":"#N/A"},{"$error":"#N/A"}]
[null,null,null,null,null,null,null,null,null,null,null,457,0,0,0,0,0,{"$error":"#N/A"},{"$error":"#N/A"},{"$error":"#N/A"},{"$error":"#N/A"},{"$error":"#N/A"},{"$error":"#N/A"},{"$error":"#N/A"},{"$error":"#N/A"},{"$error":"#N/A"},{"$error":"#N/A"}]
[null,null,null,null,null,null,null,null,null,null,null,458,0,0,0,0,0,{"$error":"#N/A"},{"$error":"#N/A"},{"$error":"#N/A"},{"$error":"#N/A"},{"$error":"#N/A"},{"$error":"#N/A"},{"$error":"#N/A"},{"$error":"#N/A"},{"$error":"#N/A"},{"$error":"#N/A"}]
[null,null,null,null,null,null,null,null,null,null,null,459,0,0,0,0,0,{"$error":"#N/A"},{"$error":"#N/A"},{"$error":"#N/A"},{"$error":"#N/A"},{"$error":"#N/A"},{"$error":"#N/A"},{"$error":"#N/A"},{"$error":"#N/A"},{"$error":"#N/A"},{"$error":"#N/A"}]
[null,null,null,null,null,null,null,null,null,null,null,460,0,0,0,0,0,{"$error":"#N/A"},{"$error":"#N/A"},{"$error":"#N/A"},{"$error":"#N/A"},{"$error":"#N/A"},{"$error":"#N/A"},{"$error":"#N/A"},{"$error":"#N/A"},{"$error":"#N/A"},{"$error":"#N/A"}]
[null,null,null,null,null,null,null,null,null,null,null,461,0,0,0,0,0,{"$error":"#N/A"},{"$error":"#N/A"},{"$error":"#N/A"},{"$error":"#N/A"},{"$error":"#N/A"},{"$error":"#N/A"},{"$error":"#N/A"},{"$error":"#N/A"},{"$error":"#N/A"},{"$error":"#N/A"}]
[null,null,null,null,null,null,null,null,null,null,null,462,{"$f":"IF(OR(kcjd<jdplant1,kcjd>jdplant1+C$22),0,kc.ini.1)","v":0},{"$f":"IF(OR(kcjd<jdplant1+C$22,kcjd>jdplant1+SUM(C$22,D$22)),0,+H$22+(kcjd-(jdplant1+C$22))/(jdplant1+SUM(C$22,D$22)-(jdplant1+C$22))*(I$22-H$22))","v":0},{"$f":"IF(OR(kcjd<jdplant1+SUM(C$22,D$22),kcjd>jdplant1+SUM(C$22,D$22,E$22)),0,kc.mid.1)","v":0},{"$f":"IF(OR(kcjd<jdplant1+SUM(C$22:E$22),kcjd>jdplant1+G$22),0,+I$22-(kcjd-(jdplant1+SUM(C$22:E$22)))/((jdplant1+G$22)-(jdplant1+SUM(C$22:E$22)))*(I$22-J$22))","v":0},0,{"$f":"IF(OR(kcjd<jdplant2,kcjd>jdplant2+$C$23),0,kc.ini.2)","v":{"$error":"#N/A"}},{"$f":"IF(OR(kcjd<jdplant2+$C$23,kcjd>jdplant2+SUM($C$23,$D$23)),0,+kc.ini.2+(kcjd-(jdplant2+$C$23))/(jdplant2+SUM($C$23,$D$23)-(jdplant2+$C$23))*(kc.mid.2-kc.ini.2))","v":{"$error":"#N/A"}},{"$f":"IF(OR(kcjd<jdplant2+SUM($C$23,$D$23),kcjd>jdplant2+SUM($C$23,$D$23,$E$23)),0,kc.mid.2)","v":{"$error":"#N/A"}},{"$f":"IF(OR(kcjd<jdplant2+SUM($C$23:$E$23),kcjd>jdplant2+$G$23),0,+kc.mid.2-(kcjd-(jdplant2+SUM($C$23:$E$23)))/((jdplant2+$G$23)-(jdplant2+SUM($C$23:$E$23)))*(kc.mid.2-kc.late.2))","v":{"$error":"#N/A"}},{"$error":"#N/A"},{"$f":"IF(OR(kcjd<jdplant3,kcjd>jdplant3+$C$24),0,kc.ini.3)","v":{"$error":"#N/A"}},{"$f":"IF(OR(kcjd<jdplant3+$C$24,kcjd>jdplant3+SUM($C$24,$D$24)),0,+kc.ini.3+(kcjd-(jdplant3+$C$24))/(jdplant3+SUM($C$24,$D$24)-(jdplant3+$C$24))*(kc.mid.3-kc.ini.3))","v":{"$error":"#N/A"}},{"$f":"IF(OR(kcjd<jdplant3+SUM($C$24,$D$24),kcjd>jdplant3+SUM($C$24,$D$24,$E$24)),0,kc.mid.3)","v":{"$error":"#N/A"}},{"$f":"IF(OR(kcjd<jdplant3+SUM($C$24:$E$24),kcjd>jdplant3+$G$24),0,+kc.mid.3-(kcjd-(jdplant3+SUM($C$24:$E$24)))/((jdplant3+$G$24)-(jdplant3+SUM($C$24:$E$24)))*(kc.mid.3-kc.late.3))","v":{"$error":"#N/A"}},{"$error":"#N/A"}]
[null,null,null,null,null,null,null,null,null,null,null,463,0,0,0,0,0,{"$error":"#N/A"},{"$error":"#N/A"},{"$error":"#N/A"},{"$error":"#N/A"},{"$error":"#N/A"},{"$error":"#N/A"},{"$error":"#N/A"},{"$error":"#N/A"},{"$error":"#N/A"},{"$error":"#N/A"}]
[null,null,null,null,null,null,null,null,null,null,null,464,0,0,0,0,0,{"$error":"#N/A"},{"$error":"#N/A"},{"$error":"#N/A"},{"$error":"#N/A"},{"$error":"#N/A"},{"$error":"#N/A"},{"$error":"#N/A"},{"$error":"#N/A"},{"$error":"#N/A"},{"$error":"#N/A"}]
[null,null,null,null,null,null,null,null,null,null,null,465,0,0,0,0,0,{"$error":"#N/A"},{"$error":"#N/A"},{"$error":"#N/A"},{"$error":"#N/A"},{"$error":"#N/A"},{"$error":"#N/A"},{"$error":"#N/A"},{"$error":"#N/A"},{"$error":"#N/A"},{"$error":"#N/A"}]
[null,null,null,null,null,null,null,null,null,null,null,466,0,0,0,0,0,{"$error":"#N/A"},{"$error":"#N/A"},{"$error":"#N/A"},{"$error":"#N/A"},{"$error":"#N/A"},{"$error":"#N/A"},{"$error":"#N/A"},{"$error":"#N/A"},{"$error":"#N/A"},{"$error":"#N/A"}]
[null,null,null,null,null,null,null,null,null,null,null,467,0,0,0,0,0,{"$error":"#N/A"},{"$error":"#N/A"},{"$error":"#N/A"},{"$error":"#N/A"},{"$error":"#N/A"},{"$error":"#N/A"},{"$error":"#N/A"},{"$error":"#N/A"},{"$error":"#N/A"},{"$error":"#N/A"}]
[null,null,null,null,null,null,null,null,null,null,null,468,0,0,0,0,0,{"$error":"#N/A"},{"$error":"#N/A"},{"$error":"#N/A"},{"$error":"#N/A"},{"$error":"#N/A"},{"$error":"#N/A"},{"$error":"#N/A"},{"$error":"#N/A"},{"$error":"#N/A"},{"$error":"#N/A"}]
[null,null,null,null,null,null,null,null,null,null,null,469,0,0,0,0,0,{"$error":"#N/A"},{"$error":"#N/A"},{"$error":"#N/A"},{"$error":"#N/A"},{"$error":"#N/A"},{"$error":"#N/A"},{"$error":"#N/A"},{"$error":"#N/A"},{"$error":"#N/A"},{"$error":"#N/A"}]
[null,null,null,null,null,null,null,null,null,null,null,470,0,0,0,0,0,{"$error":"#N/A"},{"$error":"#N/A"},{"$error":"#N/A"},{"$error":"#N/A"},{"$error":"#N/A"},{"$error":"#N/A"},{"$error":"#N/A"},{"$error":"#N/A"},{"$error":"#N/A"},{"$error":"#N/A"}]
[null,null,null,null,null,null,null,null,null,null,null,471,0,0,0,0,0,{"$error":"#N/A"},{"$error":"#N/A"},{"$error":"#N/A"},{"$error":"#N/A"},{"$error":"#N/A"},{"$error":"#N/A"},{"$error":"#N/A"},{"$error":"#N/A"},{"$error":"#N/A"},{"$error":"#N/A"}]
[null,null,null,null,null,null,null,null,null,null,null,472,0,0,0,0,0,{"$error":"#N/A"},{"$error":"#N/A"},{"$error":"#N/A"},{"$error":"#N/A"},{"$error":"#N/A"},{"$error":"#N/A"},{"$error":"#N/A"},{"$error":"#N/A"},{"$error":"#N/A"},{"$error":"#N/A"}]
[null,null,null,null,null,null,null,null,null,null,null,473,0,0,0,0,0,{"$error":"#N/A"},{"$error":"#N/A"},{"$error":"#N/A"},{"$error":"#N/A"},{"$error":"#N/A"},{"$error":"#N/A"},{"$error":"#N/A"},{"$error":"#N/A"},{"$error":"#N/A"},{"$error":"#N/A"}]
[null,null,null,null,null,null,null,null,null,null,null,474,0,0,0,0,0,{"$error":"#N/A"},{"$error":"#N/A"},{"$error":"#N/A"},{"$error":"#N/A"},{"$error":"#N/A"},{"$error":"#N/A"},{"$error":"#N/A"},{"$error":"#N/A"},{"$error":"#N/A"},{"$error":"#N/A"}]
[null,null,null,null,null,null,null,null,null,null,null,475,0,0,0,0,0,{"$error":"#N/A"},{"$error":"#N/A"},{"$error":"#N/A"},{"$error":"#N/A"},{"$error":"#N/A"},{"$error":"#N/A"},{"$error":"#N/A"},{"$error":"#N/A"},{"$error":"#N/A"},{"$error":"#N/A"}]
[null,null,null,null,null,null,null,null,null,null,null,476,0,0,0,0,0,{"$error":"#N/A"},{"$error":"#N/A"},{"$error":"#N/A"},{"$error":"#N/A"},{"$error":"#N/A"},{"$error":"#N/A"},{"$error":"#N/A"},{"$error":"#N/A"},{"$error":"#N/A"},{"$error":"#N/A"}]
[null,null,null,null,null,null,null,null,null,null,null,477,0,0,0,0,0,{"$error":"#N/A"},{"$error":"#N/A"},{"$error":"#N/A"},{"$error":"#N/A"},{"$error":"#N/A"},{"$error":"#N/A"},{"$error":"#N/A"},{"$error":"#N/A"},{"$error":"#N/A"},{"$error":"#N/A"}]
[null,null,null,null,null,null,null,null,null,null,null,478,0,0,0,0,0,{"$error":"#N/A"},{"$error":"#N/A"},{"$error":"#N/A"},{"$error":"#N/A"},{"$error":"#N/A"},{"$error":"#N/A"},{"$error":"#N/A"},{"$error":"#N/A"},{"$error":"#N/A"},{"$error":"#N/A"}]
[null,null,null,null,null,null,null,null,null,null,null,479,0,0,0,0,0,{"$error":"#N/A"},{"$error":"#N/A"},{"$error":"#N/A"},{"$error":"#N/A"},{"$error":"#N/A"},{"$error":"#N/A"},{"$error":"#N/A"},{"$error":"#N/A"},{"$error":"#N/A"},{"$error":"#N/A"}]
[null,null,null,null,null,null,null,null,null,null,null,480,0,0,0,0,0,{"$error":"#N/A"},{"$error":"#N/A"},{"$error":"#N/A"},{"$error":"#N/A"},{"$error":"#N/A"},{"$error":"#N/A"},{"$error":"#N/A"},{"$error":"#N/A"},{"$error":"#N/A"},{"$error":"#N/A"}]
[null,null,null,null,null,null,null,null,null,null,null,481,0,0,0,0,0,{"$error":"#N/A"},{"$error":"#N/A"},{"$error":"#N/A"},{"$error":"#N/A"},{"$error":"#N/A"},{"$error":"#N/A"},{"$error":"#N/A"},{"$error":"#N/A"},{"$error":"#N/A"},{"$error":"#N/A"}]
[null,null,null,null,null,null,null,null,null,null,null,482,0,0,0,0,0,{"$error":"#N/A"},{"$error":"#N/A"},{"$error":"#N/A"},{"$error":"#N/A"},{"$error":"#N/A"},{"$error":"#N/A"},{"$error":"#N/A"},{"$error":"#N/A"},{"$error":"#N/A"},{"$error":"#N/A"}]
[null,null,null,null,null,null,null,null,null,null,null,483,0,0,0,0,0,{"$error":"#N/A"},{"$error":"#N/A"},{"$error":"#N/A"},{"$error":"#N/A"},{"$error":"#N/A"},{"$error":"#N/A"},{"$error":"#N/A"},{"$error":"#N/A"},{"$error":"#N/A"},{"$error":"#N/A"}]
[null,null,null,null,null,null,null,null,null,null,null,484,0,0,0,0,0,{"$error":"#N/A"},{"$error":"#N/A"},{"$error":"#N/A"},{"$error":"#N/A"},{"$error":"#N/A"},{"$error":"#N/A"},{"$error":"#N/A"},{"$error":"#N/A"},{"$error":"#N/A"},{"$error":"#N/A"}]
[null,null,null,null,null,null,null,null,null,null,null,485,0,0,0,0,0,{"$error":"#N/A"},{"$error":"#N/A"},{"$error":"#N/A"},{"$error":"#N/A"},{"$error":"#N/A"},{"$error":"#N/A"},{"$error":"#N/A"},{"$error":"#N/A"},{"$error":"#N/A"},{"$error":"#N/A"}]

{"sheet":"water.demand.model","index":10,"n_rows":15,"n_cols":25,"rows_kept":15,"cut":false,"hidden":false,"merged":[]}
["Month","ref.et","kc.crop1","kc.crop2","kc.crop3","etc.crop1","ppt","eff.ppt.crop1","NIR.crop1","GIR.crop1","etc.crop2","eff.ppt.crop2","NIR.crop2","GIR.crop2","etc.crop3","eff.ppt.crop3","NIR.crop3","GIR.crop3","wgtd.GIR","Acre.feet","Livestock.gal","Livestock.AF",null,"SF",{"$f":"0.531747+0.295164*Y2-0.0576697*Y2^2+0.003804*Y2^3","v":0.70252795346399999}]
[1,{"$f":"VLOOKUP(county,ET.county!$A$2:$N$101,A2+2,FALSE)","v":1.562204724409449},{"$f":"+AVERAGE(kcs!Q2:Q32)","v":0},{"$f":"IFERROR(+AVERAGE(kcs!V2:V32),0)","v":0},{"$f":"IFERROR(+AVERAGE(kcs!AA2:AA32),0)","v":0},{"$f":"ref.et*kc.crop.1","v":0},{"$f":"VLOOKUP(county,ppt.county!$D$2:$T$101,6)/100","v":3.82},{"$f":"SF*(0.70917*ppt^0.82416-0.11556)*10^(0.02426*etc.crop1)","v":1.4223985206265646},{"$f":"MAX(0,etc.crop1-eff.ppt.crop1)","v":0},{"$f":"+I2/(eff.1/100)","v":0},{"$f":"ref.et*kc.crop.2","v":0},{"$f":"SF*(0.70917*ppt^0.82416-0.11556)*10^(0.02426*etc.crop2)","v":1.4223985206265646},{"$f":"MAX(0,etc.crop2-eff.ppt.crop2)","v":0},{"$f":"IFERROR(+M2/(eff.2/100),0)","v":0},{"$f":"ref.et*kc.crop.3","v":0},{"$f":"SF*(0.70917*ppt^0.82416-0.11556)*10^(0.02426*etc.crop3)","v":1.4223985206265646},{"$f":"MAX(0,etc.crop3-eff.ppt.crop3)","v":0},{"$f":"IFERROR(+Q2/(eff.3/100),0)","v":0},{"$f":"IF(total.acres<>0,GIR.crop.1*VALUE(Acres1)/total.acres+GIR.crop.2*VALUE(Acres2)/total.acres+GIR.crop.3*VALUE(Acres3)/total.acres,0)","v":0},{"$f":"IF(ISNA(wgtd.GIR),0,wgtd.GIR/12*total.acres)","v":0},{"$f":"IF(Livestock.total<>0,(VLOOKUP(Livetype1,input.form.data!$AD$2:$AE$11,2,FALSE)*VALUE(Livestock1)+VLOOKUP(Livetype2,input.form.data!$AD$2:$AE$11,2,FALSE)*VALUE(Livestock2)+VLOOKUP(Livetype3,input.form.data!$AD$2:$AE$11,2,FALSE)*VALUE(Livestock3)+VLOOKUP(Livetype4,input.form.data!$AD$2:$AE$11,2,FALSE)*VALUE(Livestock4))*VLOOKUP(A2,ET.region!$N$4:$O$15,2,FALSE),0)","v":0},{"$f":"IF(ISNA(livestock.gall),0,livestock.gall/(27154*12))","v":0},null,"D",0.66]
[2,{"$f":"VLOOKUP(county,ET.county!$A$2:$N$101,A3+2,FALSE)","v":2.0503937007874016},{"$f":"AVERAGE(kcs!Q33:Q60)","v":0},{"$f":"IFERROR(AVERAGE(kcs!V33:V60),0)","v":0},{"$f":"IFERROR(AVERAGE(kcs!AA33:AA60),0)","v":0},0,{"$f":"VLOOKUP(county,ppt.county!$D$2:$T$101,7)/100","v":3.4},1.2847747599422423,0,0,0,1.2847747599422423,0,0,0,1.2847747599422423,0,0,0,0,{"$f":"IF(Livestock.total<>0,(VLOOKUP(Livetype1,input.form.data!$AD$2:$AE$11,2)*VALUE(Livestock1)+VLOOKUP(Livetype2,input.form.data!$AD$2:$AE$11,2)*VALUE(Livestock2)+VLOOKUP(Livetype3,input.form.data!$AD$2:$AE$11,2)*VALUE(Livestock3)+VLOOKUP(Livetype4,input.form.data!$AD$2:$AE$11,2)*VALUE(Livestock4))*VLOOKUP(A3,ET.region!$N$4:$O$15,2),0)","v":0},0]
[3,{"$f":"VLOOKUP(county,ET.county!$A$2:$N$101,A4+2,FALSE)","v":3.5027559055118114},{"$f":"AVERAGE(kcs!Q61:Q91)","v":0},{"$f":"IFERROR(AVERAGE(kcs!V61:V91),0)","v":0},{"$f":"IFERROR(AVERAGE(kcs!AA61:AA91),0)","v":0},0,{"$f":"VLOOKUP(county,ppt.county!$D$2:$T$101,8)/100","v":4.16},1.5318587929256247,0,0,0,1.5318587929256247,0,0,0,1.5318587929256247,0,0,0,0,{"$f":"IF(Livestock.total<>0,(VLOOKUP(Livetype1,input.form.data!$AD$2:$AE$11,2)*VALUE(Livestock1)+VLOOKUP(Livetype2,input.form.data!$AD$2:$AE$11,2)*VALUE(Livestock2)+VLOOKUP(Livetype3,input.form.data!$AD$2:$AE$11,2)*VALUE(Livestock3)+VLOOKUP(Livetype4,input.form.data!$AD$2:$AE$11,2)*VALUE(Livestock4))*VLOOKUP(A4,ET.region!$N$4:$O$15,2),0)","v":0},0,null,null,"eff."]
[4,{"$f":"VLOOKUP(county,ET.county!$A$2:$N$101,A5+2,FALSE)","v":4.9370078740157481},{"$f":"AVERAGE(kcs!Q91:Q120)","v":0.14999999999999997},{"$f":"IFERROR(AVERAGE(kcs!V91:V120),0)","v":0},{"$f":"IFERROR(AVERAGE(kcs!AA91:AA120),0)","v":0},0.74055118110236207,{"$f":"VLOOKUP(county,ppt.county!$D$2:$T$101,9)/100","v":3.05},1.217115171218478,0,0,0,1.1677930983397162,0,0,0,1.1677930983397162,0,0,0,0,{"$f":"IF(Livestock.total<>0,(VLOOKUP(Livetype1,input.form.data!$AD$2:$AE$11,2)*VALUE(Livestock1)+VLOOKUP(Livetype2,input.form.data!$AD$2:$AE$11,2)*VALUE(Livestock2)+VLOOKUP(Livetype3,input.form.data!$AD$2:$AE$11,2)*VALUE(Livestock3)+VLOOKUP(Livetype4,input.form.data!$AD$2:$AE$11,2)*VALUE(Livestock4))*VLOOKUP(A5,ET.region!$N$4:$O$15,2),0)","v":0},0,null,null,"rainfall,SCS"]
[5,{"$f":"VLOOKUP(county,ET.county!$A$2:$N$101,A6+2,FALSE)","v":6.2122047244094487},{"$f":"AVERAGE(kcs!Q121:Q151)","v":0.72499999999999976},{"$f":"IFERROR(AVERAGE(kcs!V121:V151),0)","v":0},{"$f":"IFERROR(AVERAGE(kcs!AA121:AA151),0)","v":0},4.5038484251968489,{"$f":"VLOOKUP(county,ppt.county!$D$2:$T$101,10)/100","v":3.37},1.6395207726813783,2.8643276525154704,3.580409565644338,0,1.2748337742470151,0,0,0,1.2748337742470151,0,0,3.5804095656443384,29.83674638036949,{"$f":"IF(Livestock.total<>0,(VLOOKUP(Livetype1,input.form.data!$AD$2:$AE$11,2)*VALUE(Livestock1)+VLOOKUP(Livetype2,input.form.data!$AD$2:$AE$11,2)*VALUE(Livestock2)+VLOOKUP(Livetype3,input.form.data!$AD$2:$AE$11,2)*VALUE(Livestock3)+VLOOKUP(Livetype4,input.form.data!$AD$2:$AE$11,2)*VALUE(Livestock4))*VLOOKUP(A6,ET.region!$N$4:$O$15,2),0)","v":0},0]
[6,{"$f":"VLOOKUP(county,ET.county!$A$2:$N$101,A7+2,FALSE)","v":6.6968503937007879},{"$f":"AVERAGE(kcs!Q152:Q181)","v":1.1449999999999996},{"$f":"IFERROR(AVERAGE(kcs!V152:V181),0)","v":0},{"$f":"IFERROR(AVERAGE(kcs!AA152:AA181),0)","v":0},7.6678937007873991,{"$f":"VLOOKUP(county,ppt.county!$D$2:$T$101,11)/100","v":3.91},2.227667579735503,5.4402261210518965,6.8002826513148706,0,1.4515342347901246,0,0,0,1.4515342347901246,0,0,6.8002826513148706,56.66902209429059,{"$f":"IF(Livestock.total<>0,(VLOOKUP(Livetype1,input.form.data!$AD$2:$AE$11,2)*VALUE(Livestock1)+VLOOKUP(Livetype2,input.form.data!$AD$2:$AE$11,2)*VALUE(Livestock2)+VLOOKUP(Livetype3,input.form.data!$AD$2:$AE$11,2)*VALUE(Livestock3)+VLOOKUP(Livetype4,input.form.data!$AD$2:$AE$11,2)*VALUE(Livestock4))*VLOOKUP(A7,ET.region!$N$4:$O$15,2),0)","v":0},0]
[7,{"$f":"VLOOKUP(county,ET.county!$A$2:$N$101,A8+2,FALSE)","v":6.9444881889763792},{"$f":"AVERAGE(kcs!Q182:Q212)","v":0.17258064516129035},{"$f":"IFERROR(AVERAGE(kcs!V182:V212),0)","v":0},{"$f":"IFERROR(AVERAGE(kcs!AA182:AA212),0)","v":0},1.1984842519685044,{"$f":"VLOOKUP(county,ppt.county!$D$2:$T$101,12)/100","v":5.21},1.9894376243196841,0,0,0,1.8606089218609903,0,0,0,1.8606089218609903,0,0,0,0,{"$f":"IF(Livestock.total<>0,(VLOOKUP(Livetype1,input.form.data!$AD$2:$AE$11,2)*VALUE(Livestock1)+VLOOKUP(Livetype2,input.form.data!$AD$2:$AE$11,2)*VALUE(Livestock2)+VLOOKUP(Livetype3,input.form.data!$AD$2:$AE$11,2)*VALUE(Livestock3)+VLOOKUP(Livetype4,input.form.data!$AD$2:$AE$11,2)*VALUE(Livestock4))*VLOOKUP(A8,ET.region!$N$4:$O$15,2),0)","v":0},0]
[8,{"$f":"VLOOKUP(county,ET.county!$A$2:$N$101,A9+2,FALSE)","v":6.2122047244094487},{"$f":"AVERAGE(kcs!Q213:Q243)","v":0},{"$f":"IFERROR(AVERAGE(kcs!V213:V243),0)","v":0},{"$f":"IFERROR(AVERAGE(kcs!AA213:AA243),0)","v":0},0,{"$f":"VLOOKUP(county,ppt.county!$D$2:$T$101,13)/100","v":5.32},1.8943352549856405,0,0,0,1.8943352549856405,0,0,0,1.8943352549856405,0,0,0,0,{"$f":"IF(Livestock.total<>0,(VLOOKUP(Livetype1,input.form.data!$AD$2:$AE$11,2)*VALUE(Livestock1)+VLOOKUP(Livetype2,input.form.data!$AD$2:$AE$11,2)*VALUE(Livestock2)+VLOOKUP(Livetype3,input.form.data!$AD$2:$AE$11,2)*VALUE(Livestock3)+VLOOKUP(Livetype4,input.form.data!$AD$2:$AE$11,2)*VALUE(Livestock4))*VLOOKUP(A9,ET.region!$N$4:$O$15,2),0)","v":0},0]
[9,{"$f":"VLOOKUP(county,ET.county!$A$2:$N$101,A10+2,FALSE)","v":4.7598425196850407},{"$f":"AVERAGE(kcs!Q244:Q274)","v":0},{"$f":"IFERROR(AVERAGE(kcs!V244:V274),0)","v":0},{"$f":"IFERROR(AVERAGE(kcs!AA244:AA274),0)","v":0},0,{"$f":"VLOOKUP(county,ppt.county!$D$2:$T$101,14)/100","v":4.49},1.6366028596595743,0,0,0,1.6366028596595743,0,0,0,1.6366028596595743,0,0,0,0,{"$f":"IF(Livestock.total<>0,(VLOOKUP(Livetype1,input.form.data!$AD$2:$AE$11,2)*VALUE(Livestock1)+VLOOKUP(Livetype2,input.form.data!$AD$2:$AE$11,2)*VALUE(Livestock2)+VLOOKUP(Livetype3,input.form.data!$AD$2:$AE$11,2)*VALUE(Livestock3)+VLOOKUP(Livetype4,input.form.data!$AD$2:$AE$11,2)*VALUE(Livestock4))*VLOOKUP(A10,ET.region!$N$4:$O$15,2),0)","v":0},0]
[10,{"$f":"VLOOKUP(county,ET.county!$A$2:$N$101,A11+2,FALSE)","v":3.4417322834645669},{"$f":"AVERAGE(kcs!Q275:Q305)","v":0},{"$f":"IFERROR(AVERAGE(kcs!V275:V305),0)","v":0},{"$f":"IFERROR(AVERAGE(kcs!AA275:AA305),0)","v":0},0,{"$f":"VLOOKUP(county,ppt.county!$D$2:$T$101,15)/100","v":3.17},1.20815441521349,0,0,0,1.20815441521349,0,0,0,1.20815441521349,0,0,0,0,{"$f":"IF(Livestock.total<>0,(VLOOKUP(Livetype1,input.form.data!$AD$2:$AE$11,2)*VALUE(Livestock1)+VLOOKUP(Livetype2,input.form.data!$AD$2:$AE$11,2)*VALUE(Livestock2)+VLOOKUP(Livetype3,input.form.data!$AD$2:$AE$11,2)*VALUE(Livestock3)+VLOOKUP(Livetype4,input.form.data!$AD$2:$AE$11,2)*VALUE(Livestock4))*VLOOKUP(A11,ET.region!$N$4:$O$15,2),0)","v":0},0]
[11,{"$f":"VLOOKUP(county,ET.county!$A$2:$N$101,A12+2,FALSE)","v":2.1496062992125986},{"$f":"AVERAGE(kcs!Q306:Q335)","v":0},{"$f":"IFERROR(AVERAGE(kcs!V306:V335),0)","v":0},{"$f":"IFERROR(AVERAGE(kcs!AA306:AA335),0)","v":0},0,{"$f":"VLOOKUP(county,ppt.county!$D$2:$T$101,16)/100","v":3.19},1.2148549405884532,0,0,0,1.2148549405884532,0,0,0,1.2148549405884532,0,0,0,0,{"$f":"IF(Livestock.total<>0,(VLOOKUP(Livetype1,input.form.data!$AD$2:$AE$11,2)*VALUE(Livestock1)+VLOOKUP(Livetype2,input.form.data!$AD$2:$AE$11,2)*VALUE(Livestock2)+VLOOKUP(Livetype3,input.form.data!$AD$2:$AE$11,2)*VALUE(Livestock3)+VLOOKUP(Livetype4,input.form.data!$AD$2:$AE$11,2)*VALUE(Livestock4))*VLOOKUP(A12,ET.region!$N$4:$O$15,2),0)","v":0},0]
[12,{"$f":"VLOOKUP(county,ET.county!$A$2:$N$101,A13+2,FALSE)","v":1.5133858267716536},{"$f":"AVERAGE(kcs!Q336:Q365)","v":0},{"$f":"IFERROR(AVERAGE(kcs!V336:V365),0)","v":0},{"$f":"IFERROR(AVERAGE(kcs!AA336:AA365),0)","v":0},0,{"$f":"VLOOKUP(county,ppt.county!$D$2:$T$101,17)/100","v":3.33},1.2615548729365875,0,0,0,1.2615548729365875,0,0,0,1.2615548729365875,0,0,0,0,{"$f":"IF(Livestock.total<>0,(VLOOKUP(Livetype1,input.form.data!$AD$2:$AE$11,2)*VALUE(Livestock1)+VLOOKUP(Livetype2,input.form.data!$AD$2:$AE$11,2)*VALUE(Livestock2)+VLOOKUP(Livetype3,input.form.data!$AD$2:$AE$11,2)*VALUE(Livestock3)+VLOOKUP(Livetype4,input.form.data!$AD$2:$AE$11,2)*VALUE(Livestock4))*VLOOKUP(A13,ET.region!$N$4:$O$15,2),0)","v":0},0]
[]
["totals",null,null,null,null,{"$f":"SUM(F2:F13)","v":14.110777559055116},{"$f":"SUM(G2:G13)","v":46.42},18.528275564833223,8.3045537735673669,10.380692216959208,0,17.209304446116025,0,0,0,17.209304446116025,0,0,10.38069221695921,86.505768474660073,0,0]

{"sheet":"runoff.model","index":11,"n_rows":16,"n_cols":11,"rows_kept":16,"cut":false,"hidden":false,"merged":[]}
["Month","P","Events","Pevent","Q1","C","Qm","Cm","fig.11","C","Acre-ft"]
[1,{"$f":"VLOOKUP(county,ppt.county!$D$2:$T$101,A2+5)/100","v":3.82},{"$f":"INT(VLOOKUP(county,ppt.events.5!$D$2:$T$116,A2+5)/10)","v":2},{"$f":"+P/Events","v":1.91},{"$f":"IF(simplemethod,\"NA\",(P-0.2*S)^2/(P+0.8*S))","v":{"$error":"#VALUE!"}},{"$f":"IF(simplemethod,\"NA\",+E2/B2)","v":{"$error":"#VALUE!"}},{"$f":"IF(simplemethod,\"NA\",(Pevent-0.2*S)^2/(Pevent+0.8*S)*Events)","v":{"$error":"#VALUE!"}},{"$f":"IF(simplemethod,\"NA\",+G2/B2)","v":{"$error":"#VALUE!"}},{"$f":"IF(simplemethod,(B2/B$15*I$15),\"NA\")","v":"NA"},{"$f":"IF(simplemethod,+I2/B2,\"NA\")","v":"NA"},{"$f":"IF(simplemethod,+I2/12*wattotarea,G2/12*wattotarea)","v":{"$error":"#VALUE!"}}]
[2,{"$f":"VLOOKUP(county,ppt.county!$D$2:$T$101,A3+5)/100","v":3.4},{"$f":"INT(VLOOKUP(county,ppt.events.5!$D$2:$T$116,A3+5)/10)","v":2},1.7,{"$error":"#VALUE!"},{"$error":"#VALUE!"},{"$error":"#VALUE!"},{"$error":"#VALUE!"},"NA","NA",{"$error":"#VALUE!"}]
[3,{"$f":"VLOOKUP(county,ppt.county!$D$2:$T$101,A4+5)/100","v":4.16},{"$f":"INT(VLOOKUP(county,ppt.events.5!$D$2:$T$116,A4+5)/10)","v":3},1.3866666666666667,{"$error":"#VALUE!"},{"$error":"#VALUE!"},{"$error":"#VALUE!"},{"$error":"#VALUE!"},"NA","NA",{"$error":"#VALUE!"}]
[4,{"$f":"VLOOKUP(county,ppt.county!$D$2:$T$101,A5+5)/100","v":3.05},{"$f":"INT(VLOOKUP(county,ppt.events.5!$D$2:$T$116,A5+5)/10)","v":2},1.5249999999999999,{"$error":"#VALUE!"},{"$error":"#VALUE!"},{"$error":"#VALUE!"},{"$error":"#VALUE!"},"NA","NA",{"$error":"#VALUE!"}]
[5,{"$f":"VLOOKUP(county,ppt.county!$D$2:$T$101,A6+5)/100","v":3.37},{"$f":"INT(VLOOKUP(county,ppt.events.5!$D$2:$T$116,A6+5)/10)","v":2},1.6850000000000001,{"$error":"#VALUE!"},{"$error":"#VALUE!"},{"$error":"#VALUE!"},{"$error":"#VALUE!"},"NA","NA",{"$error":"#VALUE!"}]
[6,{"$f":"VLOOKUP(county,ppt.county!$D$2:$T$101,A7+5)/100","v":3.91},{"$f":"INT(VLOOKUP(county,ppt.events.5!$D$2:$T$116,A7+5)/10)","v":2},1.9550000000000001,{"$error":"#VALUE!"},{"$error":"#VALUE!"},{"$error":"#VALUE!"},{"$error":"#VALUE!"},"NA","NA",{"$error":"#VALUE!"}]
[7,{"$f":"VLOOKUP(county,ppt.county!$D$2:$T$101,A8+5)/100","v":5.21},{"$f":"INT(VLOOKUP(county,ppt.events.5!$D$2:$T$116,A8+5)/10)","v":3},1.7366666666666666,{"$error":"#VALUE!"},{"$error":"#VALUE!"},{"$error":"#VALUE!"},{"$error":"#VALUE!"},"NA","NA",{"$error":"#VALUE!"}]
[8,{"$f":"VLOOKUP(county,ppt.county!$D$2:$T$101,A9+5)/100","v":5.32},{"$f":"INT(VLOOKUP(county,ppt.events.5!$D$2:$T$116,A9+5)/10)","v":3},1.7733333333333334,{"$error":"#VALUE!"},{"$error":"#VALUE!"},{"$error":"#VALUE!"},{"$error":"#VALUE!"},"NA","NA",{"$error":"#VALUE!"}]
[9,{"$f":"VLOOKUP(county,ppt.county!$D$2:$T$101,A10+5)/100","v":4.49},{"$f":"INT(VLOOKUP(county,ppt.events.5!$D$2:$T$116,A10+5)/10)","v":2},2.2450000000000001,{"$error":"#VALUE!"},{"$error":"#VALUE!"},{"$error":"#VALUE!"},{"$error":"#VALUE!"},"NA","NA",{"$error":"#VALUE!"}]
[10,{"$f":"VLOOKUP(county,ppt.county!$D$2:$T$101,A11+5)/100","v":3.17},{"$f":"INT(VLOOKUP(county,ppt.events.5!$D$2:$T$116,A11+5)/10)","v":1},3.17,{"$error":"#VALUE!"},{"$error":"#VALUE!"},{"$error":"#VALUE!"},{"$error":"#VALUE!"},"NA","NA",{"$error":"#VALUE!"}]
[11,{"$f":"VLOOKUP(county,ppt.county!$D$2:$T$101,A12+5)/100","v":3.19},{"$f":"INT(VLOOKUP(county,ppt.events.5!$D$2:$T$116,A12+5)/10)","v":2},1.595,{"$error":"#VALUE!"},{"$error":"#VALUE!"},{"$error":"#VALUE!"},{"$error":"#VALUE!"},"NA","NA",{"$error":"#VALUE!"}]
[12,{"$f":"VLOOKUP(county,ppt.county!$D$2:$T$101,A13+5)/100","v":3.33},{"$f":"INT(VLOOKUP(county,ppt.events.5!$D$2:$T$116,A13+5)/10)","v":2},1.665,{"$error":"#VALUE!"},{"$error":"#VALUE!"},{"$error":"#VALUE!"},{"$error":"#VALUE!"},"NA","NA",{"$error":"#VALUE!"}]
[]
[null,{"$f":"SUM(B2:B13)","v":46.42},null,null,{"$f":"IF(simplemethod,\"NA\",SUM(E2:E13))","v":{"$error":"#VALUE!"}},{"$f":"IF(simplemethod,\"NA\",AVERAGE(F2:F13))","v":{"$error":"#VALUE!"}},{"$f":"IF(simplemethod,\"NA\",SUM(G2:G13))","v":{"$error":"#VALUE!"}},{"$f":"IF(simplemethod,\"NA\",AVERAGE(H2:H13))","v":{"$error":"#VALUE!"}},{"$f":"IF(simplemethod,1/VLOOKUP(county,ppt.county!$D$2:$AB$101,25)*12,\"NA\")","v":"NA"},{"$f":"IF(simplemethod,AVERAGE(J2:J13),\"NA\")","v":"NA"},{"$f":"SUM(K2:K13)","v":{"$error":"#VALUE!"}}]
[null,null,null,null,null,null,null,null," "]

{"sheet":"Plot","index":12,"n_rows":2,"n_cols":4,"rows_kept":2,"cut":false,"hidden":false,"merged":[]}
[null,null,null,{"$f":"IF(pname<>\"\",pname,\"\")","v":"test2"}]
[null,null,null,{"$f":"IF(location<>\"\",location,\"\")","v":"raleigh"}]

{"sheet":"inverse.design","index":13,"n_rows":29,"n_cols":17,"rows_kept":29,"cut":false,"hidden":false,"merged":[[5,6,5,9],[5,11,5,12]]}
[null,null,"County",{"$f":"county","v":"Johnston "},null,null,null,null,null,null,null,null,null,"Operation Mode"]
[null,null,"Watershed size",{"$f":"wattotarea","v":0},"acres",null,null,"Required Storage",null,null,14.4,"Enter Pond Capacity, AF",null,"irrigation first"]
[null,null,"Irrigated Area",{"$f":"total.acres","v":100},"acres",null,null,null,null,null,2,"Enter Beginning Storage, AF"]
[null,null,null,null,null,null,null,null,null,null,{"$f":"IF(K2>F21,\"Capacity > Annual Runoff, reduce size\",\"\")","v":"Capacity > Annual Runoff, reduce size"},"Pond Capacity Notes"]
[null,null,null,null,null,null,null,null,null,null,{"$f":"IF(K3>K2,\"Beginning Storage > Capacity, reduce beginning storage\", \"\")","v":""},"Beginning Storage Notes"]
[null,null,null,"Rainfall","Runoff","Runoff","-----------------Demand------------------",null,null,null,"Deficit","----Cumulative---",null,"Begin","End","Spill","Deficit"]
[null,null,"Month","in.","inches","Acre-ft","Crop, in","Crop, AF","Livestock, AF","Total, AF","AF","Runoff, AF","Demand, AF","Storage, AF","Storage, AF","AF","AF"]
[null,null,1,{"$f":"IFERROR(runoff.model!B2,0)","v":3.82},{"$f":"IFERROR(IF(wattotarea<>\"\",+runoff.model!K2*12/wattotarea,0),0)","v":0},{"$f":"IFERROR(IF(wattotarea<>\"\",+runoff.model!K2,0),0)","v":0},{"$f":"+water.demand.model!S2","v":0},{"$f":"+water.demand.model!T2","v":0},{"$f":"+water.demand.model!V2","v":0},{"$f":"SUM(H8,I8)","v":0},{"$f":"ABS(MIN(0,F8-J8))","v":0},{"$f":"+F8","v":0},{"$f":"+J8","v":0},{"$f":"+K3","v":2},{"$f":"IF(opmode=\"irrigation first\",MAX(MIN(+N8+F8-J8,pondcapacity),0),MAX(MIN(N8+F8,pondcapacity)-J8,0))","v":2},{"$f":"IF(opmode=\"irrigation first\",IF(O8>=pondcapacity,+N8+F8-J8-pondcapacity,0),MAX(+N8+F8-pondcapacity,0))","v":0},{"$f":"IF(opmode=\"irrigation first\",MIN(N8+F8-J8,0),MIN(MIN(N8+F8,pondcapacity)-J8,0))","v":0}]
[null,null,2,{"$f":"IFERROR(runoff.model!B3,0)","v":3.4},{"$f":"IFERROR(IF(wattotarea<>\"\",+runoff.model!K3*12/wattotarea,0),0)","v":0},{"$f":"IFERROR(IF(wattotarea<>\"\",+runoff.model!K3,0),0)","v":0},{"$f":"+water.demand.model!S3","v":0},{"$f":"+water.demand.model!T3","v":0},{"$f":"+water.demand.model!V3","v":0},{"$f":"SUM(H9,I9)","v":0},{"$f":"ABS(MIN(0,F9-J9))","v":0},{"$f":"+L8+F9","v":0},{"$f":"+M8+J9","v":0},{"$f":"+O8","v":2},2,0,0]
[null,null,3,{"$f":"IFERROR(runoff.model!B4,0)","v":4.16},{"$f":"IFERROR(IF(wattotarea<>\"\",+runoff.model!K4*12/wattotarea,0),0)","v":0},{"$f":"IFERROR(IF(wattotarea<>\"\",+runoff.model!K4,0),0)","v":0},{"$f":"+water.demand.model!S4","v":0},{"$f":"+water.demand.model!T4","v":0},{"$f":"+water.demand.model!V4","v":0},0,0,{"$f":"+L9+F10","v":0},{"$f":"+M9+J10","v":0},{"$f":"+O9","v":2},2,0,0]
[null,null,4,{"$f":"IFERROR(runoff.model!B5,0)","v":3.05},{"$f":"IFERROR(IF(wattotarea<>\"\",+runoff.model!K5*12/wattotarea,0),0)","v":0},{"$f":"IFERROR(IF(wattotarea<>\"\",+runoff.model!K5,0),0)","v":0},{"$f":"+water.demand.model!S5","v":0},{"$f":"+water.demand.model!T5","v":0},{"$f":"+water.demand.model!V5","v":0},0,0,0,0,2,2,0,0]
[null,null,5,{"$f":"IFERROR(runoff.model!B6,0)","v":3.37},{"$f":"IFERROR(IF(wattotarea<>\"\",+runoff.model!K6*12/wattotarea,0),0)","v":0},{"$f":"IFERROR(IF(wattotarea<>\"\",+runoff.model!K6,0),0)","v":0},{"$f":"+water.demand.model!S6","v":3.5804095656443384},{"$f":"+water.demand.model!T6","v":29.83674638036949},{"$f":"+water.demand.model!V6","v":0},29.83674638036949,29.83674638036949,0,29.83674638036949,2,0,0,-27.83674638036949]
[null,null,6,{"$f":"IFERROR(runoff.model!B7,0)","v":3.91},{"$f":"IFERROR(IF(wattotarea<>\"\",+runoff.model!K7*12/wattotarea,0),0)","v":0},{"$f":"IFERROR(IF(wattotarea<>\"\",+runoff.model!K7,0),0)","v":0},{"$f":"+water.demand.model!S7","v":6.8002826513148706},{"$f":"+water.demand.model!T7","v":56.66902209429059},{"$f":"+water.demand.model!V7","v":0},56.66902209429059,56.66902209429059,0,86.505768474660073,0,0,0,-56.66902209429059]
[null,null,7,{"$f":"IFERROR(runoff.model!B8,0)","v":5.21},{"$f":"IFERROR(IF(wattotarea<>\"\",+runoff.model!K8*12/wattotarea,0),0)","v":0},{"$f":"IFERROR(IF(wattotarea<>\"\",+runoff.model!K8,0),0)","v":0},{"$f":"+water.demand.model!S8","v":0},{"$f":"+water.demand.model!T8","v":0},{"$f":"+water.demand.model!V8","v":0},0,0,0,86.505768474660073,0,0,0,0]
[null,null,8,{"$f":"IFERROR(runoff.model!B9,0)","v":5.32},{"$f":"IFERROR(IF(wattotarea<>\"\",+runoff.model!K9*12/wattotarea,0),0)","v":0},{"$f":"IFERROR(IF(wattotarea<>\"\",+runoff.model!K9,0),0)","v":0},{"$f":"+water.demand.model!S9","v":0},{"$f":"+water.demand.model!T9","v":0},{"$f":"+water.demand.model!V9","v":0},0,0,0,86.505768474660073,0,0,0,0]
[null,null,9,{"$f":"IFERROR(runoff.model!B10,0)","v":4.49},{"$f":"IFERROR(IF(wattotarea<>\"\",+runoff.model!K10*12/wattotarea,0),0)","v":0},{"$f":"IFERROR(IF(wattotarea<>\"\",+runoff.model!K10,0),0)","v":0},{"$f":"+water.demand.model!S10","v":0},{"$f":"+water.demand.model!T10","v":0},{"$f":"+water.demand.model!V10","v":0},0,0,0,86.505768474660073,0,0,0,0]
[null,null,10,{"$f":"IFERROR(runoff.model!B11,0)","v":3.17},{"$f":"IFERROR(IF(wattotarea<>\"\",+runoff.model!K11*12/wattotarea,0),0)","v":0},{"$f":"IFERROR(IF(wattotarea<>\"\",+runoff.model!K11,0),0)","v":0},{"$f":"+water.demand.model!S11","v":0},{"$f":"+water.demand.model!T11","v":0},{"$f":"+water.demand.model!V11","v":0},0,0,0,86.505768474660073,0,0,0,0]
[null,null,11,{"$f":"IFERROR(runoff.model!B12,0)","v":3.19},{"$f":"IFERROR(IF(wattotarea<>\"\",+runoff.model!K12*12/wattotarea,0),0)","v":0},{"$f":"IFERROR(IF(wattotarea<>\"\",+runoff.model!K12,0),0)","v":0},{"$f":"+water.demand.model!S12","v":0},{"$f":"+water.demand.model!T12","v":0},{"$f":"+water.demand.model!V12","v":0},0,0,0,86.505768474660073,0,0,0,0]
[null,null,12,{"$f":"IFERROR(runoff.model!B13,0)","v":3.33},{"$f":"IFERROR(IF(wattotarea<>\"\",+runoff.model!K13*12/wattotarea,0),0)","v":0},{"$f":"IFERROR(IF(wattotarea<>\"\",+runoff.model!K13,0),0)","v":0},{"$f":"+water.demand.model!S13","v":0},{"$f":"+water.demand.model!T13","v":0},{"$f":"+water.demand.model!V13","v":0},0,0,0,86.505768474660073,0,0,0,0]
[]
[null,null,"Total",{"$f":"SUM(D8:D19)","v":46.42},0,0,10.38069221695921,86.505768474660073,0,86.505768474660073,86.505768474660073,null,null,null,null,{"$f":"SUM(P8:P19)","v":0},{"$f":"SUM(Q8:Q19)","v":-84.505768474660073}]
[]
[]
[]
[null,null,"Notes",{"$f":"IF(AND(Q21<0,P21<pondcapacity,tot.runoff<J21),\"try reducing irrigated acreage\",\"\")","v":"try reducing irrigated acreage"}]
[null,null,null,{"$f":"IF(AND(Q21<0,tot.op.spill>tot.op.deficit,tot.runoff>J21),\"try increasing pond capacity\",\"\")","v":""}]
[null,null,{"$f":"IF(AND(wattotarea=\"\",WatSize<=\"\"),\"no watershed area data entered!\",\"\")","v":""}]
[null,null,{"$f":"IF(total.acres=0,\"no irrigated acres entered!\",\"\")","v":""}]
[null,null," "]

{"sheet":"version.notes","index":14,"n_rows":22,"n_cols":3,"rows_kept":22,"cut":false,"hidden":false,"merged":[]}
["Notes:"]
[]
["Version 7.1","7.1 adds a second summary sheet showing just irrigation water requirements (no storage calculations).  This is intended for water supply planning regardless of water source"]
[]
[]
["Version 8.0","8.0 adds strawberries and sweet potato and cleans up the inverse design page.  Added storage logic to compute storage as maximum month demand if no deficit for any month (that amount of runoff will need to be collected.  Used no. of events to divide monthly precipitation in the SCS method.  Also changed required storage to be the sum of deficit if that exceeds greatest difference in cum. supply and demand.   This is because deficit assumes all of surface water used to supply demand.  "]
["Version 2.0","In pond operation page, added \"demand first\" or \"runoff first\" options which consider order of operation.  Adjusted required storage to include a scenarion when all months have adequate runoff but need somewhere to store it (for pumping/irrigation).  Version 2.0 is subsequent to Version 8.0.  Decided to go back to basic 1.0, 2.0, etc. labeling with 0.01, 0.1 for minor changes."]
["Version 8.01","Added 8 missing counties."]
["Version 8.02","Add mountain soils"]
[]
[]
[]
[]
["version 8.06","adjusted logic for pond storage in summary.sheet, to explicitly send message of inadequate runoff in cell G22 rather than compute a value, then state the message below"]
["user.form.test.1.10","replaced active x with forms for stability.  Added save and project features","2018-03-01"]
["user.form.test.1.23","Added hops","2018-04-06"]
["user.form.test.1.24","Added error messages to prompt for missing error messages"]
["user.form.test.1.25","coding changes to elimate run errors on saving and reloading"]
["uiser.form.1.26","explicitly saved (TRUE) or made blank (\"\") (FALSE) each crop type variables upon save by cropncheck.value"]
["user.form.1.27","started playing with events to try to retain selected listbox values"]
["user.form.1.28","disable save button if no user input in current session. Also explicitly looped through each listbox to find selected item upon enter and save (command button 4). Made changes in watershed and livestock too.  Set cell \"simplemethod\" to same value of rroff1state when saving in VBS, so no formula in \"simplemethod\".  Had previously used formula to assign contents in spreadsheet, but cell formula was being cleared by cursor.","2018-04-25"]
["user.form.1.28.1","did error trapping for appactivate application.Caption.  This crashed in DSW 144 teaching station"]